Build failed in Jenkins: TEIP5-Test-dev #3327

See <http://teijenkins.hcmc.uvic.ca/job/TEIP5-Test-dev/3327/display/redirect?page=changes> Changes: [lou.burnard] close 1538 ------------------------------------------ [...truncated 3.25 KB...] fi if [ git = "git" ] ; \ then \ git log --max-count=1 --pretty=format:"<info type=\"git\"><entry><commit revision=\"%h\"><date>%ai</date></commit></entry></info>" > repodate.xml ; \ fi BUILD: Generate modular DTDs, Schemas, Schematron and miscellaneous outputs ANT_OPTS="-Xss2m -Xmx752m -Djava.awt.headless=true" ant -q -lib Utilities/lib/jing.jar:Utilities/lib/saxon9he.jar -f antbuilder.xml -DXSL=<http://teijenkins.hcmc.uvic.ca/job/TEIP5-Test-dev/ws/P5/../../../Stylesheets-dev/lastSuccessful/archive/dist/xml/tei/stylesheet> -DDRIVER=Source/guidelines-en.xml base subset outputs BUILD FAILED <http://teijenkins.hcmc.uvic.ca/job/TEIP5-Test-dev/ws/P5/antbuilder.xml>:39: ; SystemID: <http://teijenkins.hcmc.uvic.ca/job/TEIP5-Test-dev/ws/P5/Utilities/expand.xsl;> Line#: 68; Column#: 21 net.sf.saxon.trans.XPathException: org.xml.sax.SAXParseException; systemId: <http://teijenkins.hcmc.uvic.ca/job/TEIP5-Test-dev/ws/P5/Source/Specs/att.global.xml;> lineNumber: 265; columnNumber: 11; The element type "attDef" must be terminated by the matching end-tag "</attDef>". at net.sf.saxon.event.Sender.sendSAXSource(Sender.java:471) at net.sf.saxon.event.Sender.send(Sender.java:153) at net.sf.saxon.functions.DocumentFn.makeDoc(DocumentFn.java:330) at net.sf.saxon.functions.Doc.call(Doc.java:138) at net.sf.saxon.functions.Doc.call(Doc.java:24) at net.sf.saxon.expr.FunctionCall.iterate(FunctionCall.java:546) at net.sf.saxon.expr.Expression.evaluateItem(Expression.java:763) at net.sf.saxon.expr.SimpleStepExpression.iterate(SimpleStepExpression.java:108) at net.sf.saxon.value.Closure.iterate(Closure.java:189) at net.sf.saxon.expr.instruct.ApplyTemplates$ApplyTemplatesPackage.processLeavingTail(ApplyTemplates.java:566) at net.sf.saxon.trans.Mode.applyTemplates(Mode.java:387) at net.sf.saxon.expr.instruct.ApplyTemplates.apply(ApplyTemplates.java:298) at net.sf.saxon.expr.instruct.ApplyTemplates.process(ApplyTemplates.java:251) at net.sf.saxon.expr.instruct.ElementCreator.processLeavingTail(ElementCreator.java:364) at net.sf.saxon.expr.instruct.Copy.processLeavingTail(Copy.java:432) at net.sf.saxon.expr.instruct.TemplateRule.applyLeavingTail(TemplateRule.java:353) at net.sf.saxon.trans.Mode.applyTemplates(Mode.java:456) at net.sf.saxon.expr.instruct.ApplyTemplates.apply(ApplyTemplates.java:298) at net.sf.saxon.expr.instruct.ApplyTemplates.process(ApplyTemplates.java:251) at net.sf.saxon.expr.instruct.ElementCreator.processLeavingTail(ElementCreator.java:364) at net.sf.saxon.expr.instruct.Copy.processLeavingTail(Copy.java:432) at net.sf.saxon.expr.instruct.TemplateRule.applyLeavingTail(TemplateRule.java:353) at net.sf.saxon.trans.Mode.applyTemplates(Mode.java:456) at net.sf.saxon.expr.instruct.ApplyTemplates.apply(ApplyTemplates.java:298) at net.sf.saxon.expr.instruct.ApplyTemplates.process(ApplyTemplates.java:251) at net.sf.saxon.expr.instruct.ElementCreator.processLeavingTail(ElementCreator.java:364) at net.sf.saxon.expr.instruct.Copy.processLeavingTail(Copy.java:432) at net.sf.saxon.expr.instruct.TemplateRule.applyLeavingTail(TemplateRule.java:353) at net.sf.saxon.trans.Mode.applyTemplates(Mode.java:456) at net.sf.saxon.expr.instruct.ApplyTemplates.apply(ApplyTemplates.java:298) at net.sf.saxon.expr.instruct.ApplyTemplates.process(ApplyTemplates.java:251) at net.sf.saxon.expr.instruct.ElementCreator.processLeavingTail(ElementCreator.java:364) at net.sf.saxon.expr.instruct.Copy.processLeavingTail(Copy.java:432) at net.sf.saxon.expr.instruct.TemplateRule.applyLeavingTail(TemplateRule.java:353) at net.sf.saxon.trans.Mode.applyTemplates(Mode.java:456) at net.sf.saxon.expr.instruct.ApplyTemplates.apply(ApplyTemplates.java:298) at net.sf.saxon.expr.instruct.ApplyTemplates.process(ApplyTemplates.java:251) at net.sf.saxon.expr.instruct.ElementCreator.processLeavingTail(ElementCreator.java:364) at net.sf.saxon.expr.instruct.Copy.processLeavingTail(Copy.java:432) at net.sf.saxon.expr.instruct.TemplateRule.applyLeavingTail(TemplateRule.java:353) at net.sf.saxon.trans.Mode.applyTemplates(Mode.java:456) at net.sf.saxon.expr.instruct.ApplyTemplates.apply(ApplyTemplates.java:298) at net.sf.saxon.expr.instruct.ApplyTemplates.process(ApplyTemplates.java:251) at net.sf.saxon.expr.instruct.ElementCreator.processLeavingTail(ElementCreator.java:364) at net.sf.saxon.expr.instruct.Copy.processLeavingTail(Copy.java:432) at net.sf.saxon.expr.instruct.TemplateRule.applyLeavingTail(TemplateRule.java:353) at net.sf.saxon.trans.Mode.applyTemplates(Mode.java:456) at net.sf.saxon.expr.instruct.ApplyTemplates$ApplyTemplatesPackage.processLeavingTail(ApplyTemplates.java:569) at net.sf.saxon.trans.Mode.applyTemplates(Mode.java:387) at net.sf.saxon.expr.instruct.ApplyTemplates.apply(ApplyTemplates.java:298) at net.sf.saxon.expr.instruct.ApplyTemplates.process(ApplyTemplates.java:251) at net.sf.saxon.expr.instruct.ElementCreator.processLeavingTail(ElementCreator.java:364) at net.sf.saxon.expr.instruct.Copy.processLeavingTail(Copy.java:432) at net.sf.saxon.expr.instruct.TemplateRule.applyLeavingTail(TemplateRule.java:353) at net.sf.saxon.trans.Mode.applyTemplates(Mode.java:456) at net.sf.saxon.expr.instruct.ApplyTemplates.apply(ApplyTemplates.java:298) at net.sf.saxon.expr.instruct.ApplyTemplates.process(ApplyTemplates.java:251) at net.sf.saxon.expr.instruct.ElementCreator.processLeavingTail(ElementCreator.java:364) at net.sf.saxon.expr.instruct.Copy.processLeavingTail(Copy.java:432) at net.sf.saxon.expr.instruct.TemplateRule.applyLeavingTail(TemplateRule.java:353) at net.sf.saxon.trans.Mode.applyTemplates(Mode.java:456) at net.sf.saxon.expr.instruct.ApplyTemplates.apply(ApplyTemplates.java:298) at net.sf.saxon.expr.instruct.ApplyTemplates.process(ApplyTemplates.java:251) at net.sf.saxon.expr.instruct.ElementCreator.processLeavingTail(ElementCreator.java:364) at net.sf.saxon.expr.instruct.Copy.processLeavingTail(Copy.java:432) at net.sf.saxon.expr.instruct.TemplateRule.applyLeavingTail(TemplateRule.java:353) at net.sf.saxon.trans.Mode.applyTemplates(Mode.java:456) at net.sf.saxon.expr.instruct.ApplyTemplates.apply(ApplyTemplates.java:298) at net.sf.saxon.expr.instruct.ApplyTemplates.process(ApplyTemplates.java:251) at net.sf.saxon.expr.instruct.DocumentInstr.evaluateItem(DocumentInstr.java:330) at net.sf.saxon.expr.instruct.DocumentInstr.evaluateItem(DocumentInstr.java:54) at net.sf.saxon.expr.parser.ExpressionTool.evaluate(ExpressionTool.java:313) at net.sf.saxon.expr.LetExpression.eval(LetExpression.java:500) at net.sf.saxon.expr.LetExpression.processLeavingTail(LetExpression.java:702) at net.sf.saxon.expr.instruct.TemplateRule.applyLeavingTail(TemplateRule.java:353) at net.sf.saxon.trans.Mode.applyTemplates(Mode.java:456) at net.sf.saxon.Controller.transformDocument(Controller.java:2291) at net.sf.saxon.Controller.transform(Controller.java:1863) at net.sf.saxon.s9api.XsltTransformer.transform(XsltTransformer.java:579) at net.sf.saxon.jaxp.TransformerImpl.transform(TransformerImpl.java:185) at org.apache.tools.ant.taskdefs.optional.TraXLiaison.transform(TraXLiaison.java:195) at org.apache.tools.ant.taskdefs.XSLTProcess.process(XSLTProcess.java:876) at org.apache.tools.ant.taskdefs.XSLTProcess.execute(XSLTProcess.java:414) at org.apache.tools.ant.UnknownElement.execute(UnknownElement.java:292) at sun.reflect.NativeMethodAccessorImpl.invoke0(Native Method) at sun.reflect.NativeMethodAccessorImpl.invoke(NativeMethodAccessorImpl.java:62) at sun.reflect.DelegatingMethodAccessorImpl.invoke(DelegatingMethodAccessorImpl.java:43) at java.lang.reflect.Method.invoke(Method.java:498) at org.apache.tools.ant.dispatch.DispatchUtils.execute(DispatchUtils.java:106) at org.apache.tools.ant.Task.perform(Task.java:348) at org.apache.tools.ant.Target.execute(Target.java:435) at org.apache.tools.ant.Target.performTasks(Target.java:456) at org.apache.tools.ant.Project.executeSortedTargets(Project.java:1393) at org.apache.tools.ant.Project.executeTarget(Project.java:1364) at org.apache.tools.ant.helper.DefaultExecutor.executeTargets(DefaultExecutor.java:41) at org.apache.tools.ant.Project.executeTargets(Project.java:1248) at org.apache.tools.ant.Main.runBuild(Main.java:851) at org.apache.tools.ant.Main.startAnt(Main.java:235) at org.apache.tools.ant.launch.Launcher.run(Launcher.java:280) at org.apache.tools.ant.launch.Launcher.main(Launcher.java:109) Caused by: org.xml.sax.SAXParseException; systemId: <http://teijenkins.hcmc.uvic.ca/job/TEIP5-Test-dev/ws/P5/Source/Specs/att.global.xml;> lineNumber: 265; columnNumber: 11; The element type "attDef" must be terminated by the matching end-tag "</attDef>". at org.apache.xerces.util.ErrorHandlerWrapper.createSAXParseException(Unknown Source) at org.apache.xerces.util.ErrorHandlerWrapper.fatalError(Unknown Source) at org.apache.xerces.impl.XMLErrorReporter.reportError(Unknown Source) at org.apache.xerces.impl.XMLErrorReporter.reportError(Unknown Source) at org.apache.xerces.impl.XMLErrorReporter.reportError(Unknown Source) at org.apache.xerces.impl.XMLScanner.reportFatalError(Unknown Source) at org.apache.xerces.impl.XMLNSDocumentScannerImpl.scanEndElement(Unknown Source) at org.apache.xerces.impl.XMLDocumentFragmentScannerImpl$FragmentContentDispatcher.dispatch(Unknown Source) at org.apache.xerces.impl.XMLDocumentFragmentScannerImpl.scanDocument(Unknown Source) at org.apache.xerces.parsers.XML11Configuration.parse(Unknown Source) at org.apache.xerces.parsers.XML11Configuration.parse(Unknown Source) at org.apache.xerces.parsers.XMLParser.parse(Unknown Source) at org.apache.xerces.parsers.AbstractSAXParser.parse(Unknown Source) at org.apache.xerces.jaxp.SAXParserImpl$JAXPSAXParser.parse(Unknown Source) at net.sf.saxon.event.Sender.sendSAXSource(Sender.java:451) ... 99 more --------- org.xml.sax.SAXParseException; systemId: <http://teijenkins.hcmc.uvic.ca/job/TEIP5-Test-dev/ws/P5/Source/Specs/att.global.xml;> lineNumber: 265; columnNumber: 11; The element type "attDef" must be terminated by the matching end-tag "</attDef>". at org.apache.xerces.util.ErrorHandlerWrapper.createSAXParseException(Unknown Source) at org.apache.xerces.util.ErrorHandlerWrapper.fatalError(Unknown Source) at org.apache.xerces.impl.XMLErrorReporter.reportError(Unknown Source) at org.apache.xerces.impl.XMLErrorReporter.reportError(Unknown Source) at org.apache.xerces.impl.XMLErrorReporter.reportError(Unknown Source) at org.apache.xerces.impl.XMLScanner.reportFatalError(Unknown Source) at org.apache.xerces.impl.XMLNSDocumentScannerImpl.scanEndElement(Unknown Source) at org.apache.xerces.impl.XMLDocumentFragmentScannerImpl$FragmentContentDispatcher.dispatch(Unknown Source) at org.apache.xerces.impl.XMLDocumentFragmentScannerImpl.scanDocument(Unknown Source) at org.apache.xerces.parsers.XML11Configuration.parse(Unknown Source) at org.apache.xerces.parsers.XML11Configuration.parse(Unknown Source) at org.apache.xerces.parsers.XMLParser.parse(Unknown Source) at org.apache.xerces.parsers.AbstractSAXParser.parse(Unknown Source) at org.apache.xerces.jaxp.SAXParserImpl$JAXPSAXParser.parse(Unknown Source) at net.sf.saxon.event.Sender.sendSAXSource(Sender.java:451) at net.sf.saxon.event.Sender.send(Sender.java:153) at net.sf.saxon.functions.DocumentFn.makeDoc(DocumentFn.java:330) at net.sf.saxon.functions.Doc.call(Doc.java:138) at net.sf.saxon.functions.Doc.call(Doc.java:24) at net.sf.saxon.expr.FunctionCall.iterate(FunctionCall.java:546) at net.sf.saxon.expr.Expression.evaluateItem(Expression.java:763) at net.sf.saxon.expr.SimpleStepExpression.iterate(SimpleStepExpression.java:108) at net.sf.saxon.value.Closure.iterate(Closure.java:189) at net.sf.saxon.expr.instruct.ApplyTemplates$ApplyTemplatesPackage.processLeavingTail(ApplyTemplates.java:566) at net.sf.saxon.trans.Mode.applyTemplates(Mode.java:387) at net.sf.saxon.expr.instruct.ApplyTemplates.apply(ApplyTemplates.java:298) at net.sf.saxon.expr.instruct.ApplyTemplates.process(ApplyTemplates.java:251) at net.sf.saxon.expr.instruct.ElementCreator.processLeavingTail(ElementCreator.java:364) at net.sf.saxon.expr.instruct.Copy.processLeavingTail(Copy.java:432) at net.sf.saxon.expr.instruct.TemplateRule.applyLeavingTail(TemplateRule.java:353) at net.sf.saxon.trans.Mode.applyTemplates(Mode.java:456) at net.sf.saxon.expr.instruct.ApplyTemplates.apply(ApplyTemplates.java:298) at net.sf.saxon.expr.instruct.ApplyTemplates.process(ApplyTemplates.java:251) at net.sf.saxon.expr.instruct.ElementCreator.processLeavingTail(ElementCreator.java:364) at net.sf.saxon.expr.instruct.Copy.processLeavingTail(Copy.java:432) at net.sf.saxon.expr.instruct.TemplateRule.applyLeavingTail(TemplateRule.java:353) at net.sf.saxon.trans.Mode.applyTemplates(Mode.java:456) at net.sf.saxon.expr.instruct.ApplyTemplates.apply(ApplyTemplates.java:298) at net.sf.saxon.expr.instruct.ApplyTemplates.process(ApplyTemplates.java:251) at net.sf.saxon.expr.instruct.ElementCreator.processLeavingTail(ElementCreator.java:364) at net.sf.saxon.expr.instruct.Copy.processLeavingTail(Copy.java:432) at net.sf.saxon.expr.instruct.TemplateRule.applyLeavingTail(TemplateRule.java:353) at net.sf.saxon.trans.Mode.applyTemplates(Mode.java:456) at net.sf.saxon.expr.instruct.ApplyTemplates.apply(ApplyTemplates.java:298) at net.sf.saxon.expr.instruct.ApplyTemplates.process(ApplyTemplates.java:251) at net.sf.saxon.expr.instruct.ElementCreator.processLeavingTail(ElementCreator.java:364) at net.sf.saxon.expr.instruct.Copy.processLeavingTail(Copy.java:432) at net.sf.saxon.expr.instruct.TemplateRule.applyLeavingTail(TemplateRule.java:353) at net.sf.saxon.trans.Mode.applyTemplates(Mode.java:456) at net.sf.saxon.expr.instruct.ApplyTemplates.apply(ApplyTemplates.java:298) at net.sf.saxon.expr.instruct.ApplyTemplates.process(ApplyTemplates.java:251) at net.sf.saxon.expr.instruct.ElementCreator.processLeavingTail(ElementCreator.java:364) at net.sf.saxon.expr.instruct.Copy.processLeavingTail(Copy.java:432) at net.sf.saxon.expr.instruct.TemplateRule.applyLeavingTail(TemplateRule.java:353) at net.sf.saxon.trans.Mode.applyTemplates(Mode.java:456) at net.sf.saxon.expr.instruct.ApplyTemplates.apply(ApplyTemplates.java:298) at net.sf.saxon.expr.instruct.ApplyTemplates.process(ApplyTemplates.java:251) at net.sf.saxon.expr.instruct.ElementCreator.processLeavingTail(ElementCreator.java:364) at net.sf.saxon.expr.instruct.Copy.processLeavingTail(Copy.java:432) at net.sf.saxon.expr.instruct.TemplateRule.applyLeavingTail(TemplateRule.java:353) at net.sf.saxon.trans.Mode.applyTemplates(Mode.java:456) at net.sf.saxon.expr.instruct.ApplyTemplates$ApplyTemplatesPackage.processLeavingTail(ApplyTemplates.java:569) at net.sf.saxon.trans.Mode.applyTemplates(Mode.java:387) at net.sf.saxon.expr.instruct.ApplyTemplates.apply(ApplyTemplates.java:298) at net.sf.saxon.expr.instruct.ApplyTemplates.process(ApplyTemplates.java:251) at net.sf.saxon.expr.instruct.ElementCreator.processLeavingTail(ElementCreator.java:364) at net.sf.saxon.expr.instruct.Copy.processLeavingTail(Copy.java:432) at net.sf.saxon.expr.instruct.TemplateRule.applyLeavingTail(TemplateRule.java:353) at net.sf.saxon.trans.Mode.applyTemplates(Mode.java:456) at net.sf.saxon.expr.instruct.ApplyTemplates.apply(ApplyTemplates.java:298) at net.sf.saxon.expr.instruct.ApplyTemplates.process(ApplyTemplates.java:251) at net.sf.saxon.expr.instruct.ElementCreator.processLeavingTail(ElementCreator.java:364) at net.sf.saxon.expr.instruct.Copy.processLeavingTail(Copy.java:432) at net.sf.saxon.expr.instruct.TemplateRule.applyLeavingTail(TemplateRule.java:353) at net.sf.saxon.trans.Mode.applyTemplates(Mode.java:456) at net.sf.saxon.expr.instruct.ApplyTemplates.apply(ApplyTemplates.java:298) at net.sf.saxon.expr.instruct.ApplyTemplates.process(ApplyTemplates.java:251) at net.sf.saxon.expr.instruct.ElementCreator.processLeavingTail(ElementCreator.java:364) at net.sf.saxon.expr.instruct.Copy.processLeavingTail(Copy.java:432) at net.sf.saxon.expr.instruct.TemplateRule.applyLeavingTail(TemplateRule.java:353) at net.sf.saxon.trans.Mode.applyTemplates(Mode.java:456) at net.sf.saxon.expr.instruct.ApplyTemplates.apply(ApplyTemplates.java:298) at net.sf.saxon.expr.instruct.ApplyTemplates.process(ApplyTemplates.java:251) at net.sf.saxon.expr.instruct.DocumentInstr.evaluateItem(DocumentInstr.java:330) at net.sf.saxon.expr.instruct.DocumentInstr.evaluateItem(DocumentInstr.java:54) at net.sf.saxon.expr.parser.ExpressionTool.evaluate(ExpressionTool.java:313) at net.sf.saxon.expr.LetExpression.eval(LetExpression.java:500) at net.sf.saxon.expr.LetExpression.processLeavingTail(LetExpression.java:702) at net.sf.saxon.expr.instruct.TemplateRule.applyLeavingTail(TemplateRule.java:353) at net.sf.saxon.trans.Mode.applyTemplates(Mode.java:456) at net.sf.saxon.Controller.transformDocument(Controller.java:2291) at net.sf.saxon.Controller.transform(Controller.java:1863) at net.sf.saxon.s9api.XsltTransformer.transform(XsltTransformer.java:579) at net.sf.saxon.jaxp.TransformerImpl.transform(TransformerImpl.java:185) at org.apache.tools.ant.taskdefs.optional.TraXLiaison.transform(TraXLiaison.java:195) at org.apache.tools.ant.taskdefs.XSLTProcess.process(XSLTProcess.java:876) at org.apache.tools.ant.taskdefs.XSLTProcess.execute(XSLTProcess.java:414) at org.apache.tools.ant.UnknownElement.execute(UnknownElement.java:292) at sun.reflect.NativeMethodAccessorImpl.invoke0(Native Method) at sun.reflect.NativeMethodAccessorImpl.invoke(NativeMethodAccessorImpl.java:62) at sun.reflect.DelegatingMethodAccessorImpl.invoke(DelegatingMethodAccessorImpl.java:43) at java.lang.reflect.Method.invoke(Method.java:498) at org.apache.tools.ant.dispatch.DispatchUtils.execute(DispatchUtils.java:106) at org.apache.tools.ant.Task.perform(Task.java:348) at org.apache.tools.ant.Target.execute(Target.java:435) at org.apache.tools.ant.Target.performTasks(Target.java:456) at org.apache.tools.ant.Project.executeSortedTargets(Project.java:1393) at org.apache.tools.ant.Project.executeTarget(Project.java:1364) at org.apache.tools.ant.helper.DefaultExecutor.executeTargets(DefaultExecutor.java:41) at org.apache.tools.ant.Project.executeTargets(Project.java:1248) at org.apache.tools.ant.Main.runBuild(Main.java:851) at org.apache.tools.ant.Main.startAnt(Main.java:235) at org.apache.tools.ant.launch.Launcher.run(Launcher.java:280) at org.apache.tools.ant.launch.Launcher.main(Launcher.java:109) Total time: 3 seconds make: *** [p5.xml] Error 1 Build step 'Execute shell' marked build as failure Not sending mail to unregistered user lou.burnard@retired.ox.ac.uk

participants (1)
-
Victoria TEI Jenkins