Build failed in Jenkins: TEIP5-dev #2813

7 Apr
2017
7 Apr
'17
8:50 p.m.
See <http://teijenkins.hcmc.uvic.ca/job/TEIP5-dev/2813/display/redirect?page=changes> Changes: [lou.burnard] removed another notTEI [lou.burnard] restore unintentionally deleted xinclude odd ------------------------------------------ Started by upstream project "TEIP5-Documentation-dev" build number 2496 originally caused by: Started by upstream project "TEIP5-Test-dev" build number 3286 originally caused by: Started by an SCM change Building in workspace <http://teijenkins.hcmc.uvic.ca/job/TEIP5-dev/ws/> > git rev-parse --is-inside-work-tree # timeout=10 Fetching changes from the remote Git repository > git config remote.origin.url https://github.com/TEIC/TEI.git # timeout=10 Fetching upstream changes from https://github.com/TEIC/TEI.git > git --version # timeout=10 > git fetch --tags --progress https://github.com/TEIC/TEI.git +refs/heads/*:refs/remotes/origin/* > git rev-parse refs/remotes/origin/dev^{commit} # timeout=10 > git rev-parse refs/remotes/origin/origin/dev^{commit} # timeout=10 Checking out Revision 7eeb6bdb748e6ab939f4eff8517cdb7df083f8e2 (refs/remotes/origin/dev) > git config core.sparsecheckout # timeout=10 > git checkout -f 7eeb6bdb748e6ab939f4eff8517cdb7df083f8e2 > git rev-list 2123dd554c0c166421d550e571a619c6783f9406 # timeout=10 [workspace] $ /bin/bash -xe /tmp/jenkins6360737199462428657.sh + svn update Skipped '.' Summary of conflicts: Skipped paths: 1 [workspace] $ /bin/bash -xe /tmp/jenkins8486290587113823159.sh + cd P5 + rm -f dist-source.stamp dist-schema.stamp dist-test.stamp dist-database.stamp dist-exemplars.stamp [workspace] $ /bin/bash -xe /tmp/jenkins1995894958982070318.sh + cd P5 ++ pwd + make VCS=git INJENKINS=true XSL=<http://teijenkins.hcmc.uvic.ca/job/TEIP5-dev/ws/P5/../../../Stylesheets-dev/lastSuccessful/archive/dist/xml/tei/stylesheet> clean deb dist (cd Exemplars; make clean) make[1]: Entering directory `<http://teijenkins.hcmc.uvic.ca/job/TEIP5-dev/ws/P5/Exemplars'> mv tei_lite_fr.nvdl tei_lite_fr.nvdl.bak rm -f *.processed *.xsd *.dtd *.doc.* *.rnc tei*.xsl tei*.rng *.compiled* *~ *.xi *.isosch *.epub *.pdf *.html *.nvdl *-teix* mv tei_lite_fr.nvdl.bak tei_lite_fr.nvdl rm -f exnames.xml rm -f enrich.rng isofs.rng rm -f names.xml *properties rm -f [A-Z]*xml make[1]: Leaving directory `<http://teijenkins.hcmc.uvic.ca/job/TEIP5-dev/ws/P5/Exemplars'> (cd Test; make clean) make[1]: Entering directory `<http://teijenkins.hcmc.uvic.ca/job/TEIP5-dev/ws/P5/Test'> rm -f test*.doc.xml test*.rnc test*.dtd test*.compiled.* test*.xsd test*.rnc test*.rng test*.xsl test*.isosch rm -rf LOG *~ *.xsd Schema RomaResults DTD rm -rf *.doc.* rm -f detest.log detest.log.all rm -f *-examples.rng *-examples.rnc *test*.nvdl *-ex.odd rm -f detest.rnc detest.rng detest.dtd detest.isosch make[1]: Leaving directory `<http://teijenkins.hcmc.uvic.ca/job/TEIP5-dev/ws/P5/Test'> rm -rf release Guidelines Guidelines-web Schema DTD dtd Split rm -rf Guidelines.??? Guidelines-* rm -f *.isosch.xsl rm -f *.stamp rm -f *.xsd rm -f Exemplars/stdout rm -f Test/*.isosch rm -f Test/detest.dtd Test/detest.rnc Test/detest.rng Test/detest.xsl rm -f Test/stdout rm -f Utilities/guidelines.xsl rm -f anything buildweb.xml rm -f p5.sch p5.isosch p5.xml p5subset.xml p5subset.json p5subset.js rm -f p5attlist.txt rm -f p5odds-examples.rng p5odds-examples.rnc p5odds.rng p5odds.rnc p5odds.isosch rm -f pdfbuild.log rm -f stripspace.xsl.model rm -f tei-*.zip rm -f tei-p5-*_*build rm -f tei-p5-*_*changes rm -f tei-p5-*_*deb rm -f teiwebsiteguidelines.zip rm -rf FASC-* rm -rf catalogue.* modList rm -rf valid v.xml ValidatorLog.xml Utilities/pointerattributes.xsl graphics.sh missfont.log v.body v.header Schematron1.xml Schematron2.xml sh ./mydch debian-tei-p5-database/debian/changelog sh: 0: Can't open ./mydch make: *** [debversion] Error 127 Build step 'Execute shell' marked build as failure Archiving artifacts Not sending mail to unregistered user lou.burnard@retired.ox.ac.uk

7 Apr
7 Apr
8:59 p.m.
New subject: [tei-council] Build failed in Jenkins: TEIP5-dev #2814
See <http://teijenkins.hcmc.uvic.ca/job/TEIP5-dev/2814/display/redirect> ------------------------------------------ Started by upstream project "TEIP5-Documentation-dev" build number 2497 originally caused by: Started by upstream project "TEIP5-Test-dev" build number 3287 originally caused by: Started by an SCM change Building in workspace <http://teijenkins.hcmc.uvic.ca/job/TEIP5-dev/ws/> > git rev-parse --is-inside-work-tree # timeout=10 Fetching changes from the remote Git repository > git config remote.origin.url https://github.com/TEIC/TEI.git # timeout=10 Fetching upstream changes from https://github.com/TEIC/TEI.git > git --version # timeout=10 > git fetch --tags --progress https://github.com/TEIC/TEI.git +refs/heads/*:refs/remotes/origin/* > git rev-parse refs/remotes/origin/dev^{commit} # timeout=10 > git rev-parse refs/remotes/origin/origin/dev^{commit} # timeout=10 Checking out Revision 7eeb6bdb748e6ab939f4eff8517cdb7df083f8e2 (refs/remotes/origin/dev) > git config core.sparsecheckout # timeout=10 > git checkout -f 7eeb6bdb748e6ab939f4eff8517cdb7df083f8e2 > git rev-list 7eeb6bdb748e6ab939f4eff8517cdb7df083f8e2 # timeout=10 [workspace] $ /bin/bash -xe /tmp/jenkins8860801096614395336.sh + svn update Skipped '.' Summary of conflicts: Skipped paths: 1 [workspace] $ /bin/bash -xe /tmp/jenkins1899546158328792998.sh + cd P5 + rm -f dist-source.stamp dist-schema.stamp dist-test.stamp dist-database.stamp dist-exemplars.stamp [workspace] $ /bin/bash -xe /tmp/jenkins134296483669412817.sh + cd P5 ++ pwd + make VCS=git INJENKINS=true XSL=<http://teijenkins.hcmc.uvic.ca/job/TEIP5-dev/ws/P5/../../../Stylesheets-dev/lastSuccessful/archive/dist/xml/tei/stylesheet> clean deb dist (cd Exemplars; make clean) make[1]: Entering directory `<http://teijenkins.hcmc.uvic.ca/job/TEIP5-dev/ws/P5/Exemplars'> mv tei_lite_fr.nvdl tei_lite_fr.nvdl.bak rm -f *.processed *.xsd *.dtd *.doc.* *.rnc tei*.xsl tei*.rng *.compiled* *~ *.xi *.isosch *.epub *.pdf *.html *.nvdl *-teix* mv tei_lite_fr.nvdl.bak tei_lite_fr.nvdl rm -f exnames.xml rm -f enrich.rng isofs.rng rm -f names.xml *properties rm -f [A-Z]*xml make[1]: Leaving directory `<http://teijenkins.hcmc.uvic.ca/job/TEIP5-dev/ws/P5/Exemplars'> (cd Test; make clean) make[1]: Entering directory `<http://teijenkins.hcmc.uvic.ca/job/TEIP5-dev/ws/P5/Test'> rm -f test*.doc.xml test*.rnc test*.dtd test*.compiled.* test*.xsd test*.rnc test*.rng test*.xsl test*.isosch rm -rf LOG *~ *.xsd Schema RomaResults DTD rm -rf *.doc.* rm -f detest.log detest.log.all rm -f *-examples.rng *-examples.rnc *test*.nvdl *-ex.odd rm -f detest.rnc detest.rng detest.dtd detest.isosch make[1]: Leaving directory `<http://teijenkins.hcmc.uvic.ca/job/TEIP5-dev/ws/P5/Test'> rm -rf release Guidelines Guidelines-web Schema DTD dtd Split rm -rf Guidelines.??? Guidelines-* rm -f *.isosch.xsl rm -f *.stamp rm -f *.xsd rm -f Exemplars/stdout rm -f Test/*.isosch rm -f Test/detest.dtd Test/detest.rnc Test/detest.rng Test/detest.xsl rm -f Test/stdout rm -f Utilities/guidelines.xsl rm -f anything buildweb.xml rm -f p5.sch p5.isosch p5.xml p5subset.xml p5subset.json p5subset.js rm -f p5attlist.txt rm -f p5odds-examples.rng p5odds-examples.rnc p5odds.rng p5odds.rnc p5odds.isosch rm -f pdfbuild.log rm -f stripspace.xsl.model rm -f tei-*.zip rm -f tei-p5-*_*build rm -f tei-p5-*_*changes rm -f tei-p5-*_*deb rm -f teiwebsiteguidelines.zip rm -rf FASC-* rm -rf catalogue.* modList rm -rf valid v.xml ValidatorLog.xml Utilities/pointerattributes.xsl graphics.sh missfont.log v.body v.header Schematron1.xml Schematron2.xml sh ./mydch debian-tei-p5-database/debian/changelog sh: 0: Can't open ./mydch make: *** [debversion] Error 127 Build step 'Execute shell' marked build as failure Archiving artifacts Not sending mail to unregistered user lou.burnard@retired.ox.ac.uk

9 Apr
9 Apr
2:26 a.m.
New subject: [tei-council] Build failed in Jenkins: TEIP5-dev #2815
See <http://teijenkins.hcmc.uvic.ca/job/TEIP5-dev/2815/display/redirect> ------------------------------------------ Started by upstream project "TEIP5-Documentation-dev" build number 2498 originally caused by: Started by upstream project "TEIP5-Test-dev" build number 3288 originally caused by: Started by upstream project "Stylesheets-dev" build number 2181 originally caused by: Started by an SCM change Building in workspace <http://teijenkins.hcmc.uvic.ca/job/TEIP5-dev/ws/> > git rev-parse --is-inside-work-tree # timeout=10 Fetching changes from the remote Git repository > git config remote.origin.url https://github.com/TEIC/TEI.git # timeout=10 Fetching upstream changes from https://github.com/TEIC/TEI.git > git --version # timeout=10 > git fetch --tags --progress https://github.com/TEIC/TEI.git +refs/heads/*:refs/remotes/origin/* > git rev-parse refs/remotes/origin/dev^{commit} # timeout=10 > git rev-parse refs/remotes/origin/origin/dev^{commit} # timeout=10 Checking out Revision 7eeb6bdb748e6ab939f4eff8517cdb7df083f8e2 (refs/remotes/origin/dev) > git config core.sparsecheckout # timeout=10 > git checkout -f 7eeb6bdb748e6ab939f4eff8517cdb7df083f8e2 > git rev-list 7eeb6bdb748e6ab939f4eff8517cdb7df083f8e2 # timeout=10 [workspace] $ /bin/bash -xe /tmp/jenkins1699201399423368565.sh + svn update Skipped '.' Summary of conflicts: Skipped paths: 1 [workspace] $ /bin/bash -xe /tmp/jenkins6429073223463141298.sh + cd P5 + rm -f dist-source.stamp dist-schema.stamp dist-test.stamp dist-database.stamp dist-exemplars.stamp [workspace] $ /bin/bash -xe /tmp/jenkins5538702761383889896.sh + cd P5 ++ pwd + make VCS=git INJENKINS=true XSL=<http://teijenkins.hcmc.uvic.ca/job/TEIP5-dev/ws/P5/../../../Stylesheets-dev/lastSuccessful/archive/dist/xml/tei/stylesheet> clean deb dist (cd Exemplars; make clean) make[1]: Entering directory `<http://teijenkins.hcmc.uvic.ca/job/TEIP5-dev/ws/P5/Exemplars'> mv tei_lite_fr.nvdl tei_lite_fr.nvdl.bak rm -f *.processed *.xsd *.dtd *.doc.* *.rnc tei*.xsl tei*.rng *.compiled* *~ *.xi *.isosch *.epub *.pdf *.html *.nvdl *-teix* mv tei_lite_fr.nvdl.bak tei_lite_fr.nvdl rm -f exnames.xml rm -f enrich.rng isofs.rng rm -f names.xml *properties rm -f [A-Z]*xml make[1]: Leaving directory `<http://teijenkins.hcmc.uvic.ca/job/TEIP5-dev/ws/P5/Exemplars'> (cd Test; make clean) make[1]: Entering directory `<http://teijenkins.hcmc.uvic.ca/job/TEIP5-dev/ws/P5/Test'> rm -f test*.doc.xml test*.rnc test*.dtd test*.compiled.* test*.xsd test*.rnc test*.rng test*.xsl test*.isosch rm -rf LOG *~ *.xsd Schema RomaResults DTD rm -rf *.doc.* rm -f detest.log detest.log.all rm -f *-examples.rng *-examples.rnc *test*.nvdl *-ex.odd rm -f detest.rnc detest.rng detest.dtd detest.isosch make[1]: Leaving directory `<http://teijenkins.hcmc.uvic.ca/job/TEIP5-dev/ws/P5/Test'> rm -rf release Guidelines Guidelines-web Schema DTD dtd Split rm -rf Guidelines.??? Guidelines-* rm -f *.isosch.xsl rm -f *.stamp rm -f *.xsd rm -f Exemplars/stdout rm -f Test/*.isosch rm -f Test/detest.dtd Test/detest.rnc Test/detest.rng Test/detest.xsl rm -f Test/stdout rm -f Utilities/guidelines.xsl rm -f anything buildweb.xml rm -f p5.sch p5.isosch p5.xml p5subset.xml p5subset.json p5subset.js rm -f p5attlist.txt rm -f p5odds-examples.rng p5odds-examples.rnc p5odds.rng p5odds.rnc p5odds.isosch rm -f pdfbuild.log rm -f stripspace.xsl.model rm -f tei-*.zip rm -f tei-p5-*_*build rm -f tei-p5-*_*changes rm -f tei-p5-*_*deb rm -f teiwebsiteguidelines.zip rm -rf FASC-* rm -rf catalogue.* modList rm -rf valid v.xml ValidatorLog.xml Utilities/pointerattributes.xsl graphics.sh missfont.log v.body v.header Schematron1.xml Schematron2.xml sh ./mydch debian-tei-p5-database/debian/changelog sh: 0: Can't open ./mydch make: *** [debversion] Error 127 Build step 'Execute shell' marked build as failure Archiving artifacts Not sending mail to unregistered user lou.burnard@retired.ox.ac.uk

3:24 a.m.
New subject: [tei-council] Build failed in Jenkins: TEIP5-dev #2816
See <http://teijenkins.hcmc.uvic.ca/job/TEIP5-dev/2816/display/redirect> ------------------------------------------ Started by upstream project "TEIP5-Documentation-dev" build number 2499 originally caused by: Started by upstream project "TEIP5-Test-dev" build number 3289 originally caused by: Started by upstream project "Stylesheets-dev" build number 2182 originally caused by: Started by an SCM change Started by an SCM change Started by an SCM change Started by an SCM change Started by an SCM change Started by an SCM change Started by an SCM change Started by an SCM change Building in workspace <http://teijenkins.hcmc.uvic.ca/job/TEIP5-dev/ws/> > git rev-parse --is-inside-work-tree # timeout=10 Fetching changes from the remote Git repository > git config remote.origin.url https://github.com/TEIC/TEI.git # timeout=10 Fetching upstream changes from https://github.com/TEIC/TEI.git > git --version # timeout=10 > git fetch --tags --progress https://github.com/TEIC/TEI.git +refs/heads/*:refs/remotes/origin/* > git rev-parse refs/remotes/origin/dev^{commit} # timeout=10 > git rev-parse refs/remotes/origin/origin/dev^{commit} # timeout=10 Checking out Revision 7eeb6bdb748e6ab939f4eff8517cdb7df083f8e2 (refs/remotes/origin/dev) > git config core.sparsecheckout # timeout=10 > git checkout -f 7eeb6bdb748e6ab939f4eff8517cdb7df083f8e2 > git rev-list 7eeb6bdb748e6ab939f4eff8517cdb7df083f8e2 # timeout=10 [workspace] $ /bin/bash -xe /tmp/jenkins8339120087933144618.sh + svn update Skipped '.' Summary of conflicts: Skipped paths: 1 [workspace] $ /bin/bash -xe /tmp/jenkins2718278530168883028.sh + cd P5 + rm -f dist-source.stamp dist-schema.stamp dist-test.stamp dist-database.stamp dist-exemplars.stamp [workspace] $ /bin/bash -xe /tmp/jenkins3605489104722026369.sh + cd P5 ++ pwd + make VCS=git INJENKINS=true XSL=<http://teijenkins.hcmc.uvic.ca/job/TEIP5-dev/ws/P5/../../../Stylesheets-dev/lastSuccessful/archive/dist/xml/tei/stylesheet> clean deb dist (cd Exemplars; make clean) make[1]: Entering directory `<http://teijenkins.hcmc.uvic.ca/job/TEIP5-dev/ws/P5/Exemplars'> mv tei_lite_fr.nvdl tei_lite_fr.nvdl.bak rm -f *.processed *.xsd *.dtd *.doc.* *.rnc tei*.xsl tei*.rng *.compiled* *~ *.xi *.isosch *.epub *.pdf *.html *.nvdl *-teix* mv tei_lite_fr.nvdl.bak tei_lite_fr.nvdl rm -f exnames.xml rm -f enrich.rng isofs.rng rm -f names.xml *properties rm -f [A-Z]*xml make[1]: Leaving directory `<http://teijenkins.hcmc.uvic.ca/job/TEIP5-dev/ws/P5/Exemplars'> (cd Test; make clean) make[1]: Entering directory `<http://teijenkins.hcmc.uvic.ca/job/TEIP5-dev/ws/P5/Test'> rm -f test*.doc.xml test*.rnc test*.dtd test*.compiled.* test*.xsd test*.rnc test*.rng test*.xsl test*.isosch rm -rf LOG *~ *.xsd Schema RomaResults DTD rm -rf *.doc.* rm -f detest.log detest.log.all rm -f *-examples.rng *-examples.rnc *test*.nvdl *-ex.odd rm -f detest.rnc detest.rng detest.dtd detest.isosch make[1]: Leaving directory `<http://teijenkins.hcmc.uvic.ca/job/TEIP5-dev/ws/P5/Test'> rm -rf release Guidelines Guidelines-web Schema DTD dtd Split rm -rf Guidelines.??? Guidelines-* rm -f *.isosch.xsl rm -f *.stamp rm -f *.xsd rm -f Exemplars/stdout rm -f Test/*.isosch rm -f Test/detest.dtd Test/detest.rnc Test/detest.rng Test/detest.xsl rm -f Test/stdout rm -f Utilities/guidelines.xsl rm -f anything buildweb.xml rm -f p5.sch p5.isosch p5.xml p5subset.xml p5subset.json p5subset.js rm -f p5attlist.txt rm -f p5odds-examples.rng p5odds-examples.rnc p5odds.rng p5odds.rnc p5odds.isosch rm -f pdfbuild.log rm -f stripspace.xsl.model rm -f tei-*.zip rm -f tei-p5-*_*build rm -f tei-p5-*_*changes rm -f tei-p5-*_*deb rm -f teiwebsiteguidelines.zip rm -rf FASC-* rm -rf catalogue.* modList rm -rf valid v.xml ValidatorLog.xml Utilities/pointerattributes.xsl graphics.sh missfont.log v.body v.header Schematron1.xml Schematron2.xml sh ./mydch debian-tei-p5-database/debian/changelog sh: 0: Can't open ./mydch make: *** [debversion] Error 127 Build step 'Execute shell' marked build as failure Archiving artifacts Not sending mail to unregistered user lou.burnard@retired.ox.ac.uk

4:08 a.m.
New subject: [tei-council] Build failed in Jenkins: TEIP5-dev #2817
See <http://teijenkins.hcmc.uvic.ca/job/TEIP5-dev/2817/display/redirect> ------------------------------------------ Started by upstream project "TEIP5-Documentation-dev" build number 2500 originally caused by: Started by upstream project "TEIP5-Test-dev" build number 3290 originally caused by: Started by upstream project "Stylesheets-dev" build number 2183 originally caused by: Started by an SCM change Started by an SCM change Started by an SCM change Started by an SCM change Started by an SCM change Started by an SCM change Started by an SCM change Started by an SCM change Started by an SCM change Started by an SCM change Started by an SCM change Building in workspace <http://teijenkins.hcmc.uvic.ca/job/TEIP5-dev/ws/> > git rev-parse --is-inside-work-tree # timeout=10 Fetching changes from the remote Git repository > git config remote.origin.url https://github.com/TEIC/TEI.git # timeout=10 Fetching upstream changes from https://github.com/TEIC/TEI.git > git --version # timeout=10 > git fetch --tags --progress https://github.com/TEIC/TEI.git +refs/heads/*:refs/remotes/origin/* > git rev-parse refs/remotes/origin/dev^{commit} # timeout=10 > git rev-parse refs/remotes/origin/origin/dev^{commit} # timeout=10 Checking out Revision 7eeb6bdb748e6ab939f4eff8517cdb7df083f8e2 (refs/remotes/origin/dev) > git config core.sparsecheckout # timeout=10 > git checkout -f 7eeb6bdb748e6ab939f4eff8517cdb7df083f8e2 > git rev-list 7eeb6bdb748e6ab939f4eff8517cdb7df083f8e2 # timeout=10 [workspace] $ /bin/bash -xe /tmp/jenkins9126595410795597734.sh + svn update Skipped '.' Summary of conflicts: Skipped paths: 1 [workspace] $ /bin/bash -xe /tmp/jenkins2243606831258396809.sh + cd P5 + rm -f dist-source.stamp dist-schema.stamp dist-test.stamp dist-database.stamp dist-exemplars.stamp [workspace] $ /bin/bash -xe /tmp/jenkins191344973787660113.sh + cd P5 ++ pwd + make VCS=git INJENKINS=true XSL=<http://teijenkins.hcmc.uvic.ca/job/TEIP5-dev/ws/P5/../../../Stylesheets-dev/lastSuccessful/archive/dist/xml/tei/stylesheet> clean deb dist (cd Exemplars; make clean) make[1]: Entering directory `<http://teijenkins.hcmc.uvic.ca/job/TEIP5-dev/ws/P5/Exemplars'> mv tei_lite_fr.nvdl tei_lite_fr.nvdl.bak rm -f *.processed *.xsd *.dtd *.doc.* *.rnc tei*.xsl tei*.rng *.compiled* *~ *.xi *.isosch *.epub *.pdf *.html *.nvdl *-teix* mv tei_lite_fr.nvdl.bak tei_lite_fr.nvdl rm -f exnames.xml rm -f enrich.rng isofs.rng rm -f names.xml *properties rm -f [A-Z]*xml make[1]: Leaving directory `<http://teijenkins.hcmc.uvic.ca/job/TEIP5-dev/ws/P5/Exemplars'> (cd Test; make clean) make[1]: Entering directory `<http://teijenkins.hcmc.uvic.ca/job/TEIP5-dev/ws/P5/Test'> rm -f test*.doc.xml test*.rnc test*.dtd test*.compiled.* test*.xsd test*.rnc test*.rng test*.xsl test*.isosch rm -rf LOG *~ *.xsd Schema RomaResults DTD rm -rf *.doc.* rm -f detest.log detest.log.all rm -f *-examples.rng *-examples.rnc *test*.nvdl *-ex.odd rm -f detest.rnc detest.rng detest.dtd detest.isosch make[1]: Leaving directory `<http://teijenkins.hcmc.uvic.ca/job/TEIP5-dev/ws/P5/Test'> rm -rf release Guidelines Guidelines-web Schema DTD dtd Split rm -rf Guidelines.??? Guidelines-* rm -f *.isosch.xsl rm -f *.stamp rm -f *.xsd rm -f Exemplars/stdout rm -f Test/*.isosch rm -f Test/detest.dtd Test/detest.rnc Test/detest.rng Test/detest.xsl rm -f Test/stdout rm -f Utilities/guidelines.xsl rm -f anything buildweb.xml rm -f p5.sch p5.isosch p5.xml p5subset.xml p5subset.json p5subset.js rm -f p5attlist.txt rm -f p5odds-examples.rng p5odds-examples.rnc p5odds.rng p5odds.rnc p5odds.isosch rm -f pdfbuild.log rm -f stripspace.xsl.model rm -f tei-*.zip rm -f tei-p5-*_*build rm -f tei-p5-*_*changes rm -f tei-p5-*_*deb rm -f teiwebsiteguidelines.zip rm -rf FASC-* rm -rf catalogue.* modList rm -rf valid v.xml ValidatorLog.xml Utilities/pointerattributes.xsl graphics.sh missfont.log v.body v.header Schematron1.xml Schematron2.xml sh ./mydch debian-tei-p5-database/debian/changelog sh: 0: Can't open ./mydch make: *** [debversion] Error 127 Build step 'Execute shell' marked build as failure Archiving artifacts Not sending mail to unregistered user lou.burnard@retired.ox.ac.uk

9:40 p.m.
New subject: [tei-council] Build failed in Jenkins: TEIP5-dev #2818
See <http://teijenkins.hcmc.uvic.ca/job/TEIP5-dev/2818/display/redirect> ------------------------------------------ Started by upstream project "TEIP5-Documentation-dev" build number 2501 originally caused by: Started by upstream project "TEIP5-Test-dev" build number 3291 originally caused by: Started by upstream project "Stylesheets-dev" build number 2184 originally caused by: Started by an SCM change Building in workspace <http://teijenkins.hcmc.uvic.ca/job/TEIP5-dev/ws/> > git rev-parse --is-inside-work-tree # timeout=10 Fetching changes from the remote Git repository > git config remote.origin.url https://github.com/TEIC/TEI.git # timeout=10 Fetching upstream changes from https://github.com/TEIC/TEI.git > git --version # timeout=10 > git fetch --tags --progress https://github.com/TEIC/TEI.git +refs/heads/*:refs/remotes/origin/* > git rev-parse refs/remotes/origin/dev^{commit} # timeout=10 > git rev-parse refs/remotes/origin/origin/dev^{commit} # timeout=10 Checking out Revision 7eeb6bdb748e6ab939f4eff8517cdb7df083f8e2 (refs/remotes/origin/dev) > git config core.sparsecheckout # timeout=10 > git checkout -f 7eeb6bdb748e6ab939f4eff8517cdb7df083f8e2 > git rev-list 7eeb6bdb748e6ab939f4eff8517cdb7df083f8e2 # timeout=10 [workspace] $ /bin/bash -xe /tmp/jenkins2738418581885702417.sh + svn update Skipped '.' Summary of conflicts: Skipped paths: 1 [workspace] $ /bin/bash -xe /tmp/jenkins1318004166763485796.sh + cd P5 + rm -f dist-source.stamp dist-schema.stamp dist-test.stamp dist-database.stamp dist-exemplars.stamp [workspace] $ /bin/bash -xe /tmp/jenkins1027288543716527653.sh + cd P5 ++ pwd + make VCS=git INJENKINS=true XSL=<http://teijenkins.hcmc.uvic.ca/job/TEIP5-dev/ws/P5/../../../Stylesheets-dev/lastSuccessful/archive/dist/xml/tei/stylesheet> clean deb dist (cd Exemplars; make clean) make[1]: Entering directory `<http://teijenkins.hcmc.uvic.ca/job/TEIP5-dev/ws/P5/Exemplars'> mv tei_lite_fr.nvdl tei_lite_fr.nvdl.bak rm -f *.processed *.xsd *.dtd *.doc.* *.rnc tei*.xsl tei*.rng *.compiled* *~ *.xi *.isosch *.epub *.pdf *.html *.nvdl *-teix* mv tei_lite_fr.nvdl.bak tei_lite_fr.nvdl rm -f exnames.xml rm -f enrich.rng isofs.rng rm -f names.xml *properties rm -f [A-Z]*xml make[1]: Leaving directory `<http://teijenkins.hcmc.uvic.ca/job/TEIP5-dev/ws/P5/Exemplars'> (cd Test; make clean) make[1]: Entering directory `<http://teijenkins.hcmc.uvic.ca/job/TEIP5-dev/ws/P5/Test'> rm -f test*.doc.xml test*.rnc test*.dtd test*.compiled.* test*.xsd test*.rnc test*.rng test*.xsl test*.isosch rm -rf LOG *~ *.xsd Schema RomaResults DTD rm -rf *.doc.* rm -f detest.log detest.log.all rm -f *-examples.rng *-examples.rnc *test*.nvdl *-ex.odd rm -f detest.rnc detest.rng detest.dtd detest.isosch make[1]: Leaving directory `<http://teijenkins.hcmc.uvic.ca/job/TEIP5-dev/ws/P5/Test'> rm -rf release Guidelines Guidelines-web Schema DTD dtd Split rm -rf Guidelines.??? Guidelines-* rm -f *.isosch.xsl rm -f *.stamp rm -f *.xsd rm -f Exemplars/stdout rm -f Test/*.isosch rm -f Test/detest.dtd Test/detest.rnc Test/detest.rng Test/detest.xsl rm -f Test/stdout rm -f Utilities/guidelines.xsl rm -f anything buildweb.xml rm -f p5.sch p5.isosch p5.xml p5subset.xml p5subset.json p5subset.js rm -f p5attlist.txt rm -f p5odds-examples.rng p5odds-examples.rnc p5odds.rng p5odds.rnc p5odds.isosch rm -f pdfbuild.log rm -f stripspace.xsl.model rm -f tei-*.zip rm -f tei-p5-*_*build rm -f tei-p5-*_*changes rm -f tei-p5-*_*deb rm -f teiwebsiteguidelines.zip rm -rf FASC-* rm -rf catalogue.* modList rm -rf valid v.xml ValidatorLog.xml Utilities/pointerattributes.xsl graphics.sh missfont.log v.body v.header Schematron1.xml Schematron2.xml sh ./mydch debian-tei-p5-database/debian/changelog sh: 0: Can't open ./mydch make: *** [debversion] Error 127 Build step 'Execute shell' marked build as failure Archiving artifacts Not sending mail to unregistered user lou.burnard@retired.ox.ac.uk

10:52 p.m.
New subject: [tei-council] Build failed in Jenkins: TEIP5-dev #2819
See <http://teijenkins.hcmc.uvic.ca/job/TEIP5-dev/2819/display/redirect?page=changes> Changes: [lou.burnard] restore accidentally deleted mydch ------------------------------------------ Started by upstream project "TEIP5-Documentation-dev" build number 2502 originally caused by: Started by upstream project "TEIP5-Test-dev" build number 3292 originally caused by: Started by an SCM change Building in workspace <http://teijenkins.hcmc.uvic.ca/job/TEIP5-dev/ws/> > git rev-parse --is-inside-work-tree # timeout=10 Fetching changes from the remote Git repository > git config remote.origin.url https://github.com/TEIC/TEI.git # timeout=10 Fetching upstream changes from https://github.com/TEIC/TEI.git > git --version # timeout=10 > git fetch --tags --progress https://github.com/TEIC/TEI.git +refs/heads/*:refs/remotes/origin/* > git rev-parse refs/remotes/origin/dev^{commit} # timeout=10 > git rev-parse refs/remotes/origin/origin/dev^{commit} # timeout=10 Checking out Revision 1c5cca093346ba833858d2e7de519cc000bb8266 (refs/remotes/origin/dev) > git config core.sparsecheckout # timeout=10 > git checkout -f 1c5cca093346ba833858d2e7de519cc000bb8266 > git rev-list 7eeb6bdb748e6ab939f4eff8517cdb7df083f8e2 # timeout=10 [workspace] $ /bin/bash -xe /tmp/jenkins6271449026265432469.sh + svn update Skipped '.' Summary of conflicts: Skipped paths: 1 [workspace] $ /bin/bash -xe /tmp/jenkins181874845032927910.sh + cd P5 + rm -f dist-source.stamp dist-schema.stamp dist-test.stamp dist-database.stamp dist-exemplars.stamp [workspace] $ /bin/bash -xe /tmp/jenkins8187707303577040342.sh + cd P5 ++ pwd + make VCS=git INJENKINS=true XSL=<http://teijenkins.hcmc.uvic.ca/job/TEIP5-dev/ws/P5/../../../Stylesheets-dev/lastSuccessful/archive/dist/xml/tei/stylesheet> clean deb dist (cd Exemplars; make clean) make[1]: Entering directory `<http://teijenkins.hcmc.uvic.ca/job/TEIP5-dev/ws/P5/Exemplars'> mv tei_lite_fr.nvdl tei_lite_fr.nvdl.bak rm -f *.processed *.xsd *.dtd *.doc.* *.rnc tei*.xsl tei*.rng *.compiled* *~ *.xi *.isosch *.epub *.pdf *.html *.nvdl *-teix* mv tei_lite_fr.nvdl.bak tei_lite_fr.nvdl rm -f exnames.xml rm -f enrich.rng isofs.rng rm -f names.xml *properties rm -f [A-Z]*xml make[1]: Leaving directory `<http://teijenkins.hcmc.uvic.ca/job/TEIP5-dev/ws/P5/Exemplars'> (cd Test; make clean) make[1]: Entering directory `<http://teijenkins.hcmc.uvic.ca/job/TEIP5-dev/ws/P5/Test'> rm -f test*.doc.xml test*.rnc test*.dtd test*.compiled.* test*.xsd test*.rnc test*.rng test*.xsl test*.isosch rm -rf LOG *~ *.xsd Schema RomaResults DTD rm -rf *.doc.* rm -f detest.log detest.log.all rm -f *-examples.rng *-examples.rnc *test*.nvdl *-ex.odd rm -f detest.rnc detest.rng detest.dtd detest.isosch make[1]: Leaving directory `<http://teijenkins.hcmc.uvic.ca/job/TEIP5-dev/ws/P5/Test'> rm -rf release Guidelines Guidelines-web Schema DTD dtd Split rm -rf Guidelines.??? Guidelines-* rm -f *.isosch.xsl rm -f *.stamp rm -f *.xsd rm -f Exemplars/stdout rm -f Test/*.isosch rm -f Test/detest.dtd Test/detest.rnc Test/detest.rng Test/detest.xsl rm -f Test/stdout rm -f Utilities/guidelines.xsl rm -f anything buildweb.xml rm -f p5.sch p5.isosch p5.xml p5subset.xml p5subset.json p5subset.js rm -f p5attlist.txt rm -f p5odds-examples.rng p5odds-examples.rnc p5odds.rng p5odds.rnc p5odds.isosch rm -f pdfbuild.log rm -f stripspace.xsl.model rm -f tei-*.zip rm -f tei-p5-*_*build rm -f tei-p5-*_*changes rm -f tei-p5-*_*deb rm -f teiwebsiteguidelines.zip rm -rf FASC-* rm -rf catalogue.* modList rm -rf valid v.xml ValidatorLog.xml Utilities/pointerattributes.xsl graphics.sh missfont.log v.body v.header Schematron1.xml Schematron2.xml sh ./mydch debian-tei-p5-database/debian/changelog ./mydch: 4: [: f: unexpected operator head: cannot open ‘1’ for reading: No such file or directory head: cannot open ‘1’ for reading: No such file or directory head: cannot open ‘1’ for reading: No such file or directory grep: write error: Broken pipe head: cannot open ‘1’ for reading: No such file or directory grep: write error: Broken pipe ./mydch: 18: [: /ebian-tei-p5-/atabase//ebian/changelog: unexpected operator update with 3.1.1a sh ./mydch debian-tei-p5-doc/debian/changelog ./mydch: 4: [: f: unexpected operator head: cannot open ‘1’ for reading: No such file or directory head: cannot open ‘1’ for reading: No such file or directory head: cannot open ‘1’ for reading: No such file or directory grep: write error: Broken pipe head: cannot open ‘1’ for reading: No such file or directory grep: write error: Broken pipe ./mydch: 18: [: /ebian-tei-p5-/oc//ebian/changelog: unexpected operator update with 3.1.1a sh ./mydch debian-tei-p5-exemplars/debian/changelog ./mydch: 4: [: f: unexpected operator head: cannot open ‘1’ for reading: No such file or directory head: cannot open ‘1’ for reading: No such file or directory head: cannot open ‘1’ for reading: No such file or directory grep: write error: Broken pipe head: cannot open ‘1’ for reading: No such file or directory grep: write error: Broken pipe ./mydch: 18: [: /ebian-tei-p5-exemplars//ebian/changelog: unexpected operator update with 3.1.1a sh ./mydch debian-tei-p5-schema/debian/changelog ./mydch: 4: [: f: unexpected operator head: cannot open ‘1’ for reading: No such file or directory head: cannot open ‘1’ for reading: No such file or directory head: cannot open ‘1’ for reading: No such file or directory grep: write error: Broken pipe head: cannot open ‘1’ for reading: No such file or directory grep: write error: Broken pipe ./mydch: 18: [: /ebian-tei-p5-schema//ebian/changelog: unexpected operator update with 3.1.1a sh ./mydch debian-tei-p5-source/debian/changelog ./mydch: 4: [: f: unexpected operator head: cannot open ‘1’ for reading: No such file or directory head: cannot open ‘1’ for reading: No such file or directory head: cannot open ‘1’ for reading: No such file or directory grep: write error: Broken pipe head: cannot open ‘1’ for reading: No such file or directory grep: write error: Broken pipe ./mydch: 18: [: /ebian-tei-p5-source//ebian/changelog: unexpected operator update with 3.1.1a sh ./mydch debian-tei-p5-test/debian/changelog ./mydch: 4: [: f: unexpected operator head: cannot open ‘1’ for reading: No such file or directory head: cannot open ‘1’ for reading: No such file or directory head: cannot open ‘1’ for reading: No such file or directory grep: write error: Broken pipe head: cannot open ‘1’ for reading: No such file or directory grep: write error: Broken pipe ./mydch: 18: [: /ebian-tei-p5-test//ebian/changelog: unexpected operator update with 3.1.1a rm -f tei-p5-*_*deb rm -f tei-p5-*_*changes rm -f tei-p5-*_*build BUILD: make Debian tei-p5-database package (cd debian-tei-p5-database; debclean;debuild -eXSL=<http://teijenkins.hcmc.uvic.ca/job/TEIP5-dev/ws/P5/../../../Stylesheets-dev/lastSuccessful/archive/dist/xml/tei/stylesheet> -eVCS=git -eINJENKINS=true --no-lintian -nc -b -i.svn -I.svn -uc -us) Cleaning in directory . parsechangelog/debian: warning: debian/changelog(l1): badly formatted heading line LINE: ==> parsechangelog/debian: warning: debian/changelog(l3): found eof where expected first heading parsechangelog/debian: error: fatal error occurred while parsing debian/changelog dpkg-parsechangelog: error: changelog parser /usr/lib/dpkg/parsechangelog/debian gave error exit status 255 Directory .: unable to determine package name, skipping parsechangelog/debian: warning: debian/changelog(l1): badly formatted heading line LINE: ==> parsechangelog/debian: warning: debian/changelog(l3): found eof where expected first heading parsechangelog/debian: error: fatal error occurred while parsing debian/changelog dpkg-parsechangelog: error: changelog parser /usr/lib/dpkg/parsechangelog/debian gave error exit status 255 debuild: fatal error at line 639: cannot execute dpkg-parsechangelog | grep: make: *** [deb] Error 255 Build step 'Execute shell' marked build as failure Archiving artifacts Not sending mail to unregistered user lou.burnard@retired.ox.ac.uk

10 Apr
10 Apr
12:18 a.m.
New subject: [tei-council] Build failed in Jenkins: TEIP5-dev #2820
See <http://teijenkins.hcmc.uvic.ca/job/TEIP5-dev/2820/display/redirect?page=changes> Changes: [martindholmes] Making restored shell script executable. [martindholmes] Trying to get the executable flag to stick. ------------------------------------------ Started by user Martin Holmes Building in workspace <http://teijenkins.hcmc.uvic.ca/job/TEIP5-dev/ws/> > git rev-parse --is-inside-work-tree # timeout=10 Fetching changes from the remote Git repository > git config remote.origin.url https://github.com/TEIC/TEI.git # timeout=10 Fetching upstream changes from https://github.com/TEIC/TEI.git > git --version # timeout=10 > git fetch --tags --progress https://github.com/TEIC/TEI.git +refs/heads/*:refs/remotes/origin/* > git rev-parse refs/remotes/origin/dev^{commit} # timeout=10 > git rev-parse refs/remotes/origin/origin/dev^{commit} # timeout=10 Checking out Revision 627734578418f23183201f50e5a3ff2e7a07d79a (refs/remotes/origin/dev) > git config core.sparsecheckout # timeout=10 > git checkout -f 627734578418f23183201f50e5a3ff2e7a07d79a > git rev-list 1c5cca093346ba833858d2e7de519cc000bb8266 # timeout=10 [workspace] $ /bin/bash -xe /tmp/jenkins3504225623366339217.sh + svn update Skipped '.' Summary of conflicts: Skipped paths: 1 [workspace] $ /bin/bash -xe /tmp/jenkins2918078356457342581.sh + cd P5 + rm -f dist-source.stamp dist-schema.stamp dist-test.stamp dist-database.stamp dist-exemplars.stamp [workspace] $ /bin/bash -xe /tmp/jenkins9097300978943467971.sh + cd P5 ++ pwd + make VCS=git INJENKINS=true XSL=<http://teijenkins.hcmc.uvic.ca/job/TEIP5-dev/ws/P5/../../../Stylesheets-dev/lastSuccessful/archive/dist/xml/tei/stylesheet> clean deb dist (cd Exemplars; make clean) make[1]: Entering directory `<http://teijenkins.hcmc.uvic.ca/job/TEIP5-dev/ws/P5/Exemplars'> mv tei_lite_fr.nvdl tei_lite_fr.nvdl.bak rm -f *.processed *.xsd *.dtd *.doc.* *.rnc tei*.xsl tei*.rng *.compiled* *~ *.xi *.isosch *.epub *.pdf *.html *.nvdl *-teix* mv tei_lite_fr.nvdl.bak tei_lite_fr.nvdl rm -f exnames.xml rm -f enrich.rng isofs.rng rm -f names.xml *properties rm -f [A-Z]*xml make[1]: Leaving directory `<http://teijenkins.hcmc.uvic.ca/job/TEIP5-dev/ws/P5/Exemplars'> (cd Test; make clean) make[1]: Entering directory `<http://teijenkins.hcmc.uvic.ca/job/TEIP5-dev/ws/P5/Test'> rm -f test*.doc.xml test*.rnc test*.dtd test*.compiled.* test*.xsd test*.rnc test*.rng test*.xsl test*.isosch rm -rf LOG *~ *.xsd Schema RomaResults DTD rm -rf *.doc.* rm -f detest.log detest.log.all rm -f *-examples.rng *-examples.rnc *test*.nvdl *-ex.odd rm -f detest.rnc detest.rng detest.dtd detest.isosch make[1]: Leaving directory `<http://teijenkins.hcmc.uvic.ca/job/TEIP5-dev/ws/P5/Test'> rm -rf release Guidelines Guidelines-web Schema DTD dtd Split rm -rf Guidelines.??? Guidelines-* rm -f *.isosch.xsl rm -f *.stamp rm -f *.xsd rm -f Exemplars/stdout rm -f Test/*.isosch rm -f Test/detest.dtd Test/detest.rnc Test/detest.rng Test/detest.xsl rm -f Test/stdout rm -f Utilities/guidelines.xsl rm -f anything buildweb.xml rm -f p5.sch p5.isosch p5.xml p5subset.xml p5subset.json p5subset.js rm -f p5attlist.txt rm -f p5odds-examples.rng p5odds-examples.rnc p5odds.rng p5odds.rnc p5odds.isosch rm -f pdfbuild.log rm -f stripspace.xsl.model rm -f tei-*.zip rm -f tei-p5-*_*build rm -f tei-p5-*_*changes rm -f tei-p5-*_*deb rm -f teiwebsiteguidelines.zip rm -rf FASC-* rm -rf catalogue.* modList rm -rf valid v.xml ValidatorLog.xml Utilities/pointerattributes.xsl graphics.sh missfont.log v.body v.header Schematron1.xml Schematron2.xml sh ./mydch debian-tei-p5-database/debian/changelog ./mydch: 4: [: f: unexpected operator head: cannot open ‘1’ for reading: No such file or directory head: cannot open ‘1’ for reading: No such file or directory head: cannot open ‘1’ for reading: No such file or directory grep: write error: Broken pipe head: cannot open ‘1’ for reading: No such file or directory grep: write error: Broken pipe ./mydch: 18: [: /ebian-tei-p5-/atabase//ebian/changelog: unexpected operator update with 3.1.1a sh ./mydch debian-tei-p5-doc/debian/changelog ./mydch: 4: [: f: unexpected operator head: cannot open ‘1’ for reading: No such file or directory head: cannot open ‘1’ for reading: No such file or directory head: cannot open ‘1’ for reading: No such file or directory grep: write error: Broken pipe head: cannot open ‘1’ for reading: No such file or directory grep: write error: Broken pipe ./mydch: 18: [: /ebian-tei-p5-/oc//ebian/changelog: unexpected operator update with 3.1.1a sh ./mydch debian-tei-p5-exemplars/debian/changelog ./mydch: 4: [: f: unexpected operator head: cannot open ‘1’ for reading: No such file or directory head: cannot open ‘1’ for reading: No such file or directory head: cannot open ‘1’ for reading: No such file or directory grep: write error: Broken pipe head: cannot open ‘1’ for reading: No such file or directory grep: write error: Broken pipe ./mydch: 18: [: /ebian-tei-p5-exemplars//ebian/changelog: unexpected operator update with 3.1.1a sh ./mydch debian-tei-p5-schema/debian/changelog ./mydch: 4: [: f: unexpected operator head: cannot open ‘1’ for reading: No such file or directory head: cannot open ‘1’ for reading: No such file or directory head: cannot open ‘1’ for reading: No such file or directory grep: write error: Broken pipe head: cannot open ‘1’ for reading: No such file or directory grep: write error: Broken pipe ./mydch: 18: [: /ebian-tei-p5-schema//ebian/changelog: unexpected operator update with 3.1.1a sh ./mydch debian-tei-p5-source/debian/changelog ./mydch: 4: [: f: unexpected operator head: cannot open ‘1’ for reading: No such file or directory head: cannot open ‘1’ for reading: No such file or directory head: cannot open ‘1’ for reading: No such file or directory grep: write error: Broken pipe head: cannot open ‘1’ for reading: No such file or directory grep: write error: Broken pipe ./mydch: 18: [: /ebian-tei-p5-source//ebian/changelog: unexpected operator update with 3.1.1a sh ./mydch debian-tei-p5-test/debian/changelog ./mydch: 4: [: f: unexpected operator head: cannot open ‘1’ for reading: No such file or directory head: cannot open ‘1’ for reading: No such file or directory head: cannot open ‘1’ for reading: No such file or directory grep: write error: Broken pipe head: cannot open ‘1’ for reading: No such file or directory grep: write error: Broken pipe ./mydch: 18: [: /ebian-tei-p5-test//ebian/changelog: unexpected operator update with 3.1.1a rm -f tei-p5-*_*deb rm -f tei-p5-*_*changes rm -f tei-p5-*_*build BUILD: make Debian tei-p5-database package (cd debian-tei-p5-database; debclean;debuild -eXSL=<http://teijenkins.hcmc.uvic.ca/job/TEIP5-dev/ws/P5/../../../Stylesheets-dev/lastSuccessful/archive/dist/xml/tei/stylesheet> -eVCS=git -eINJENKINS=true --no-lintian -nc -b -i.svn -I.svn -uc -us) Cleaning in directory . parsechangelog/debian: warning: debian/changelog(l1): badly formatted heading line LINE: ==> parsechangelog/debian: warning: debian/changelog(l2): badly formatted heading line LINE: ==> parsechangelog/debian: warning: debian/changelog(l4): found eof where expected first heading parsechangelog/debian: error: fatal error occurred while parsing debian/changelog dpkg-parsechangelog: error: changelog parser /usr/lib/dpkg/parsechangelog/debian gave error exit status 255 Directory .: unable to determine package name, skipping parsechangelog/debian: warning: debian/changelog(l1): badly formatted heading line LINE: ==> parsechangelog/debian: warning: debian/changelog(l2): badly formatted heading line LINE: ==> parsechangelog/debian: warning: debian/changelog(l4): found eof where expected first heading parsechangelog/debian: error: fatal error occurred while parsing debian/changelog dpkg-parsechangelog: error: changelog parser /usr/lib/dpkg/parsechangelog/debian gave error exit status 255 debuild: fatal error at line 639: cannot execute dpkg-parsechangelog | grep: make: *** [deb] Error 255 Build step 'Execute shell' marked build as failure Archiving artifacts Not sending mail to unregistered user mholmes@uvic.ca Not sending mail to unregistered user lou.burnard@retired.ox.ac.uk

12:45 a.m.
New subject: [tei-council] Build failed in Jenkins: TEIP5-dev #2821
See <http://teijenkins.hcmc.uvic.ca/job/TEIP5-dev/2821/display/redirect> ------------------------------------------ Started by upstream project "TEIP5-Documentation-dev" build number 2503 originally caused by: Started by upstream project "TEIP5-Test-dev" build number 3293 originally caused by: Started by an SCM change Building in workspace <http://teijenkins.hcmc.uvic.ca/job/TEIP5-dev/ws/> > git rev-parse --is-inside-work-tree # timeout=10 Fetching changes from the remote Git repository > git config remote.origin.url https://github.com/TEIC/TEI.git # timeout=10 Fetching upstream changes from https://github.com/TEIC/TEI.git > git --version # timeout=10 > git fetch --tags --progress https://github.com/TEIC/TEI.git +refs/heads/*:refs/remotes/origin/* > git rev-parse refs/remotes/origin/dev^{commit} # timeout=10 > git rev-parse refs/remotes/origin/origin/dev^{commit} # timeout=10 Checking out Revision 627734578418f23183201f50e5a3ff2e7a07d79a (refs/remotes/origin/dev) > git config core.sparsecheckout # timeout=10 > git checkout -f 627734578418f23183201f50e5a3ff2e7a07d79a > git rev-list 627734578418f23183201f50e5a3ff2e7a07d79a # timeout=10 [workspace] $ /bin/bash -xe /tmp/jenkins6426423739763151951.sh + svn update Skipped '.' Summary of conflicts: Skipped paths: 1 [workspace] $ /bin/bash -xe /tmp/jenkins1667460067346068006.sh + cd P5 + rm -f dist-source.stamp dist-schema.stamp dist-test.stamp dist-database.stamp dist-exemplars.stamp [workspace] $ /bin/bash -xe /tmp/jenkins4761131558661832445.sh + cd P5 ++ pwd + make VCS=git INJENKINS=true XSL=<http://teijenkins.hcmc.uvic.ca/job/TEIP5-dev/ws/P5/../../../Stylesheets-dev/lastSuccessful/archive/dist/xml/tei/stylesheet> clean deb dist (cd Exemplars; make clean) make[1]: Entering directory `<http://teijenkins.hcmc.uvic.ca/job/TEIP5-dev/ws/P5/Exemplars'> mv tei_lite_fr.nvdl tei_lite_fr.nvdl.bak rm -f *.processed *.xsd *.dtd *.doc.* *.rnc tei*.xsl tei*.rng *.compiled* *~ *.xi *.isosch *.epub *.pdf *.html *.nvdl *-teix* mv tei_lite_fr.nvdl.bak tei_lite_fr.nvdl rm -f exnames.xml rm -f enrich.rng isofs.rng rm -f names.xml *properties rm -f [A-Z]*xml make[1]: Leaving directory `<http://teijenkins.hcmc.uvic.ca/job/TEIP5-dev/ws/P5/Exemplars'> (cd Test; make clean) make[1]: Entering directory `<http://teijenkins.hcmc.uvic.ca/job/TEIP5-dev/ws/P5/Test'> rm -f test*.doc.xml test*.rnc test*.dtd test*.compiled.* test*.xsd test*.rnc test*.rng test*.xsl test*.isosch rm -rf LOG *~ *.xsd Schema RomaResults DTD rm -rf *.doc.* rm -f detest.log detest.log.all rm -f *-examples.rng *-examples.rnc *test*.nvdl *-ex.odd rm -f detest.rnc detest.rng detest.dtd detest.isosch make[1]: Leaving directory `<http://teijenkins.hcmc.uvic.ca/job/TEIP5-dev/ws/P5/Test'> rm -rf release Guidelines Guidelines-web Schema DTD dtd Split rm -rf Guidelines.??? Guidelines-* rm -f *.isosch.xsl rm -f *.stamp rm -f *.xsd rm -f Exemplars/stdout rm -f Test/*.isosch rm -f Test/detest.dtd Test/detest.rnc Test/detest.rng Test/detest.xsl rm -f Test/stdout rm -f Utilities/guidelines.xsl rm -f anything buildweb.xml rm -f p5.sch p5.isosch p5.xml p5subset.xml p5subset.json p5subset.js rm -f p5attlist.txt rm -f p5odds-examples.rng p5odds-examples.rnc p5odds.rng p5odds.rnc p5odds.isosch rm -f pdfbuild.log rm -f stripspace.xsl.model rm -f tei-*.zip rm -f tei-p5-*_*build rm -f tei-p5-*_*changes rm -f tei-p5-*_*deb rm -f teiwebsiteguidelines.zip rm -rf FASC-* rm -rf catalogue.* modList rm -rf valid v.xml ValidatorLog.xml Utilities/pointerattributes.xsl graphics.sh missfont.log v.body v.header Schematron1.xml Schematron2.xml sh ./mydch debian-tei-p5-database/debian/changelog ./mydch: 4: [: f: unexpected operator head: cannot open ‘1’ for reading: No such file or directory head: cannot open ‘1’ for reading: No such file or directory head: cannot open ‘1’ for reading: No such file or directory grep: write error: Broken pipe head: cannot open ‘1’ for reading: No such file or directory grep: write error: Broken pipe update with 3.1.1a sh ./mydch debian-tei-p5-doc/debian/changelog ./mydch: 4: [: f: unexpected operator head: cannot open ‘1’ for reading: No such file or directory head: cannot open ‘1’ for reading: No such file or directory head: cannot open ‘1’ for reading: No such file or directory grep: write error: Broken pipe head: cannot open ‘1’ for reading: No such file or directory grep: write error: Broken pipe update with 3.1.1a sh ./mydch debian-tei-p5-exemplars/debian/changelog ./mydch: 4: [: f: unexpected operator head: cannot open ‘1’ for reading: No such file or directory head: cannot open ‘1’ for reading: No such file or directory head: cannot open ‘1’ for reading: No such file or directory head: cannot open ‘1’ for reading: No such file or directory update with 3.1.1a sh ./mydch debian-tei-p5-schema/debian/changelog ./mydch: 4: [: f: unexpected operator head: cannot open ‘1’ for reading: No such file or directory head: cannot open ‘1’ for reading: No such file or directory head: cannot open ‘1’ for reading: No such file or directory head: cannot open ‘1’ for reading: No such file or directory update with 3.1.1a sh ./mydch debian-tei-p5-source/debian/changelog ./mydch: 4: [: f: unexpected operator head: cannot open ‘1’ for reading: No such file or directory head: cannot open ‘1’ for reading: No such file or directory head: cannot open ‘1’ for reading: No such file or directory head: cannot open ‘1’ for reading: No such file or directory update with 3.1.1a sh ./mydch debian-tei-p5-test/debian/changelog ./mydch: 4: [: f: unexpected operator head: cannot open ‘1’ for reading: No such file or directory head: cannot open ‘1’ for reading: No such file or directory head: cannot open ‘1’ for reading: No such file or directory head: cannot open ‘1’ for reading: No such file or directory update with 3.1.1a rm -f tei-p5-*_*deb rm -f tei-p5-*_*changes rm -f tei-p5-*_*build BUILD: make Debian tei-p5-database package (cd debian-tei-p5-database; debclean;debuild -eXSL=<http://teijenkins.hcmc.uvic.ca/job/TEIP5-dev/ws/P5/../../../Stylesheets-dev/lastSuccessful/archive/dist/xml/tei/stylesheet> -eVCS=git -eINJENKINS=true --no-lintian -nc -b -i.svn -I.svn -uc -us) Cleaning in directory . parsechangelog/debian: warning: debian/changelog(l1): badly formatted heading line LINE: ==> parsechangelog/debian: warning: debian/changelog(l2): badly formatted heading line LINE: ==> parsechangelog/debian: warning: debian/changelog(l3): badly formatted heading line LINE: ==> parsechangelog/debian: warning: debian/changelog(l5): found eof where expected first heading parsechangelog/debian: error: fatal error occurred while parsing debian/changelog dpkg-parsechangelog: error: changelog parser /usr/lib/dpkg/parsechangelog/debian gave error exit status 255 Directory .: unable to determine package name, skipping parsechangelog/debian: warning: debian/changelog(l1): badly formatted heading line LINE: ==> parsechangelog/debian: warning: debian/changelog(l2): badly formatted heading line LINE: ==> parsechangelog/debian: warning: debian/changelog(l3): badly formatted heading line LINE: ==> parsechangelog/debian: warning: debian/changelog(l5): found eof where expected first heading parsechangelog/debian: error: fatal error occurred while parsing debian/changelog dpkg-parsechangelog: error: changelog parser /usr/lib/dpkg/parsechangelog/debian gave error exit status 255 debuild: fatal error at line 639: cannot execute dpkg-parsechangelog | grep: make: *** [deb] Error 255 Build step 'Execute shell' marked build as failure Archiving artifacts Not sending mail to unregistered user mholmes@uvic.ca Not sending mail to unregistered user lou.burnard@retired.ox.ac.uk

12:58 a.m.
New subject: [tei-council] Build failed in Jenkins: TEIP5-dev #2822
See <http://teijenkins.hcmc.uvic.ca/job/TEIP5-dev/2822/display/redirect> ------------------------------------------ Started by upstream project "TEIP5-Documentation-dev" build number 2504 originally caused by: Started by upstream project "TEIP5-Test-dev" build number 3294 originally caused by: Started by upstream project "Stylesheets-dev" build number 2186 originally caused by: Started by an SCM change Building in workspace <http://teijenkins.hcmc.uvic.ca/job/TEIP5-dev/ws/> > git rev-parse --is-inside-work-tree # timeout=10 Fetching changes from the remote Git repository > git config remote.origin.url https://github.com/TEIC/TEI.git # timeout=10 Fetching upstream changes from https://github.com/TEIC/TEI.git > git --version # timeout=10 > git fetch --tags --progress https://github.com/TEIC/TEI.git +refs/heads/*:refs/remotes/origin/* > git rev-parse refs/remotes/origin/dev^{commit} # timeout=10 > git rev-parse refs/remotes/origin/origin/dev^{commit} # timeout=10 Checking out Revision 627734578418f23183201f50e5a3ff2e7a07d79a (refs/remotes/origin/dev) > git config core.sparsecheckout # timeout=10 > git checkout -f 627734578418f23183201f50e5a3ff2e7a07d79a > git rev-list 627734578418f23183201f50e5a3ff2e7a07d79a # timeout=10 [workspace] $ /bin/bash -xe /tmp/jenkins162931493258495326.sh + svn update Skipped '.' Summary of conflicts: Skipped paths: 1 [workspace] $ /bin/bash -xe /tmp/jenkins2503125182153696589.sh + cd P5 + rm -f dist-source.stamp dist-schema.stamp dist-test.stamp dist-database.stamp dist-exemplars.stamp [workspace] $ /bin/bash -xe /tmp/jenkins6163638074067103431.sh + cd P5 ++ pwd + make VCS=git INJENKINS=true XSL=<http://teijenkins.hcmc.uvic.ca/job/TEIP5-dev/ws/P5/../../../Stylesheets-dev/lastSuccessful/archive/dist/xml/tei/stylesheet> clean deb dist (cd Exemplars; make clean) make[1]: Entering directory `<http://teijenkins.hcmc.uvic.ca/job/TEIP5-dev/ws/P5/Exemplars'> mv tei_lite_fr.nvdl tei_lite_fr.nvdl.bak rm -f *.processed *.xsd *.dtd *.doc.* *.rnc tei*.xsl tei*.rng *.compiled* *~ *.xi *.isosch *.epub *.pdf *.html *.nvdl *-teix* mv tei_lite_fr.nvdl.bak tei_lite_fr.nvdl rm -f exnames.xml rm -f enrich.rng isofs.rng rm -f names.xml *properties rm -f [A-Z]*xml make[1]: Leaving directory `<http://teijenkins.hcmc.uvic.ca/job/TEIP5-dev/ws/P5/Exemplars'> (cd Test; make clean) make[1]: Entering directory `<http://teijenkins.hcmc.uvic.ca/job/TEIP5-dev/ws/P5/Test'> rm -f test*.doc.xml test*.rnc test*.dtd test*.compiled.* test*.xsd test*.rnc test*.rng test*.xsl test*.isosch rm -rf LOG *~ *.xsd Schema RomaResults DTD rm -rf *.doc.* rm -f detest.log detest.log.all rm -f *-examples.rng *-examples.rnc *test*.nvdl *-ex.odd rm -f detest.rnc detest.rng detest.dtd detest.isosch make[1]: Leaving directory `<http://teijenkins.hcmc.uvic.ca/job/TEIP5-dev/ws/P5/Test'> rm -rf release Guidelines Guidelines-web Schema DTD dtd Split rm -rf Guidelines.??? Guidelines-* rm -f *.isosch.xsl rm -f *.stamp rm -f *.xsd rm -f Exemplars/stdout rm -f Test/*.isosch rm -f Test/detest.dtd Test/detest.rnc Test/detest.rng Test/detest.xsl rm -f Test/stdout rm -f Utilities/guidelines.xsl rm -f anything buildweb.xml rm -f p5.sch p5.isosch p5.xml p5subset.xml p5subset.json p5subset.js rm -f p5attlist.txt rm -f p5odds-examples.rng p5odds-examples.rnc p5odds.rng p5odds.rnc p5odds.isosch rm -f pdfbuild.log rm -f stripspace.xsl.model rm -f tei-*.zip rm -f tei-p5-*_*build rm -f tei-p5-*_*changes rm -f tei-p5-*_*deb rm -f teiwebsiteguidelines.zip rm -rf FASC-* rm -rf catalogue.* modList rm -rf valid v.xml ValidatorLog.xml Utilities/pointerattributes.xsl graphics.sh missfont.log v.body v.header Schematron1.xml Schematron2.xml sh ./mydch debian-tei-p5-database/debian/changelog ./mydch: 4: [: f: unexpected operator head: cannot open ‘1’ for reading: No such file or directory head: cannot open ‘1’ for reading: No such file or directory head: cannot open ‘1’ for reading: No such file or directory grep: write error: Broken pipe head: cannot open ‘1’ for reading: No such file or directory ./mydch: 18: [: /ebian-tei-p5-/atabase//ebian/changelog: unexpected operator update with 3.1.1a sh ./mydch debian-tei-p5-doc/debian/changelog ./mydch: 4: [: f: unexpected operator head: cannot open ‘1’ for reading: No such file or directory head: cannot open ‘1’ for reading: No such file or directory head: cannot open ‘1’ for reading: No such file or directory head: cannot open ‘1’ for reading: No such file or directory ./mydch: 18: [: /ebian-tei-p5-/oc//ebian/changelog: unexpected operator update with 3.1.1a sh ./mydch debian-tei-p5-exemplars/debian/changelog ./mydch: 4: [: f: unexpected operator head: cannot open ‘1’ for reading: No such file or directory head: cannot open ‘1’ for reading: No such file or directory head: cannot open ‘1’ for reading: No such file or directory head: cannot open ‘1’ for reading: No such file or directory ./mydch: 18: [: /ebian-tei-p5-exemplars//ebian/changelog: unexpected operator update with 3.1.1a sh ./mydch debian-tei-p5-schema/debian/changelog ./mydch: 4: [: f: unexpected operator head: cannot open ‘1’ for reading: No such file or directory head: cannot open ‘1’ for reading: No such file or directory head: cannot open ‘1’ for reading: No such file or directory head: cannot open ‘1’ for reading: No such file or directory ./mydch: 18: [: /ebian-tei-p5-schema//ebian/changelog: unexpected operator update with 3.1.1a sh ./mydch debian-tei-p5-source/debian/changelog ./mydch: 4: [: f: unexpected operator head: cannot open ‘1’ for reading: No such file or directory head: cannot open ‘1’ for reading: No such file or directory head: cannot open ‘1’ for reading: No such file or directory grep: write error: Broken pipe head: cannot open ‘1’ for reading: No such file or directory ./mydch: 18: [: /ebian-tei-p5-source//ebian/changelog: unexpected operator update with 3.1.1a sh ./mydch debian-tei-p5-test/debian/changelog ./mydch: 4: [: f: unexpected operator head: cannot open ‘1’ for reading: No such file or directory head: cannot open ‘1’ for reading: No such file or directory head: cannot open ‘1’ for reading: No such file or directory grep: write error: Broken pipe head: cannot open ‘1’ for reading: No such file or directory grep: write error: Broken pipe ./mydch: 18: [: /ebian-tei-p5-test//ebian/changelog: unexpected operator update with 3.1.1a rm -f tei-p5-*_*deb rm -f tei-p5-*_*changes rm -f tei-p5-*_*build BUILD: make Debian tei-p5-database package (cd debian-tei-p5-database; debclean;debuild -eXSL=<http://teijenkins.hcmc.uvic.ca/job/TEIP5-dev/ws/P5/../../../Stylesheets-dev/lastSuccessful/archive/dist/xml/tei/stylesheet> -eVCS=git -eINJENKINS=true --no-lintian -nc -b -i.svn -I.svn -uc -us) Cleaning in directory . parsechangelog/debian: warning: debian/changelog(l1): badly formatted heading line LINE: ==> parsechangelog/debian: warning: debian/changelog(l2): badly formatted heading line LINE: ==> parsechangelog/debian: warning: debian/changelog(l3): badly formatted heading line LINE: ==> parsechangelog/debian: warning: debian/changelog(l4): badly formatted heading line LINE: ==> parsechangelog/debian: warning: debian/changelog(l6): found eof where expected first heading parsechangelog/debian: error: fatal error occurred while parsing debian/changelog dpkg-parsechangelog: error: changelog parser /usr/lib/dpkg/parsechangelog/debian gave error exit status 255 Directory .: unable to determine package name, skipping parsechangelog/debian: warning: debian/changelog(l1): badly formatted heading line LINE: ==> parsechangelog/debian: warning: debian/changelog(l2): badly formatted heading line LINE: ==> parsechangelog/debian: warning: debian/changelog(l3): badly formatted heading line LINE: ==> parsechangelog/debian: warning: debian/changelog(l4): badly formatted heading line LINE: ==> parsechangelog/debian: warning: debian/changelog(l6): found eof where expected first heading parsechangelog/debian: error: fatal error occurred while parsing debian/changelog dpkg-parsechangelog: error: changelog parser /usr/lib/dpkg/parsechangelog/debian gave error exit status 255 debuild: fatal error at line 639: cannot execute dpkg-parsechangelog | grep: make: *** [deb] Error 255 Build step 'Execute shell' marked build as failure Archiving artifacts Not sending mail to unregistered user mholmes@uvic.ca Not sending mail to unregistered user lou.burnard@retired.ox.ac.uk

1:42 a.m.
New subject: [tei-council] Build failed in Jenkins: TEIP5-dev #2823
See <http://teijenkins.hcmc.uvic.ca/job/TEIP5-dev/2823/display/redirect> ------------------------------------------ Started by upstream project "TEIP5-Documentation-dev" build number 2505 originally caused by: Started by upstream project "TEIP5-Test-dev" build number 3295 originally caused by: Started by upstream project "Stylesheets-dev" build number 2187 originally caused by: Started by an SCM change Started by an SCM change Started by an SCM change Started by an SCM change Started by an SCM change Started by an SCM change Started by an SCM change Building in workspace <http://teijenkins.hcmc.uvic.ca/job/TEIP5-dev/ws/> > git rev-parse --is-inside-work-tree # timeout=10 Fetching changes from the remote Git repository > git config remote.origin.url https://github.com/TEIC/TEI.git # timeout=10 Fetching upstream changes from https://github.com/TEIC/TEI.git > git --version # timeout=10 > git fetch --tags --progress https://github.com/TEIC/TEI.git +refs/heads/*:refs/remotes/origin/* > git rev-parse refs/remotes/origin/dev^{commit} # timeout=10 > git rev-parse refs/remotes/origin/origin/dev^{commit} # timeout=10 Checking out Revision 627734578418f23183201f50e5a3ff2e7a07d79a (refs/remotes/origin/dev) > git config core.sparsecheckout # timeout=10 > git checkout -f 627734578418f23183201f50e5a3ff2e7a07d79a > git rev-list 627734578418f23183201f50e5a3ff2e7a07d79a # timeout=10 [workspace] $ /bin/bash -xe /tmp/jenkins8589661614542609957.sh + svn update Skipped '.' Summary of conflicts: Skipped paths: 1 [workspace] $ /bin/bash -xe /tmp/jenkins7600102720648738402.sh + cd P5 + rm -f dist-source.stamp dist-schema.stamp dist-test.stamp dist-database.stamp dist-exemplars.stamp [workspace] $ /bin/bash -xe /tmp/jenkins4169377629411167710.sh + cd P5 ++ pwd + make VCS=git INJENKINS=true XSL=<http://teijenkins.hcmc.uvic.ca/job/TEIP5-dev/ws/P5/../../../Stylesheets-dev/lastSuccessful/archive/dist/xml/tei/stylesheet> clean deb dist (cd Exemplars; make clean) make[1]: Entering directory `<http://teijenkins.hcmc.uvic.ca/job/TEIP5-dev/ws/P5/Exemplars'> mv tei_lite_fr.nvdl tei_lite_fr.nvdl.bak rm -f *.processed *.xsd *.dtd *.doc.* *.rnc tei*.xsl tei*.rng *.compiled* *~ *.xi *.isosch *.epub *.pdf *.html *.nvdl *-teix* mv tei_lite_fr.nvdl.bak tei_lite_fr.nvdl rm -f exnames.xml rm -f enrich.rng isofs.rng rm -f names.xml *properties rm -f [A-Z]*xml make[1]: Leaving directory `<http://teijenkins.hcmc.uvic.ca/job/TEIP5-dev/ws/P5/Exemplars'> (cd Test; make clean) make[1]: Entering directory `<http://teijenkins.hcmc.uvic.ca/job/TEIP5-dev/ws/P5/Test'> rm -f test*.doc.xml test*.rnc test*.dtd test*.compiled.* test*.xsd test*.rnc test*.rng test*.xsl test*.isosch rm -rf LOG *~ *.xsd Schema RomaResults DTD rm -rf *.doc.* rm -f detest.log detest.log.all rm -f *-examples.rng *-examples.rnc *test*.nvdl *-ex.odd rm -f detest.rnc detest.rng detest.dtd detest.isosch make[1]: Leaving directory `<http://teijenkins.hcmc.uvic.ca/job/TEIP5-dev/ws/P5/Test'> rm -rf release Guidelines Guidelines-web Schema DTD dtd Split rm -rf Guidelines.??? Guidelines-* rm -f *.isosch.xsl rm -f *.stamp rm -f *.xsd rm -f Exemplars/stdout rm -f Test/*.isosch rm -f Test/detest.dtd Test/detest.rnc Test/detest.rng Test/detest.xsl rm -f Test/stdout rm -f Utilities/guidelines.xsl rm -f anything buildweb.xml rm -f p5.sch p5.isosch p5.xml p5subset.xml p5subset.json p5subset.js rm -f p5attlist.txt rm -f p5odds-examples.rng p5odds-examples.rnc p5odds.rng p5odds.rnc p5odds.isosch rm -f pdfbuild.log rm -f stripspace.xsl.model rm -f tei-*.zip rm -f tei-p5-*_*build rm -f tei-p5-*_*changes rm -f tei-p5-*_*deb rm -f teiwebsiteguidelines.zip rm -rf FASC-* rm -rf catalogue.* modList rm -rf valid v.xml ValidatorLog.xml Utilities/pointerattributes.xsl graphics.sh missfont.log v.body v.header Schematron1.xml Schematron2.xml sh ./mydch debian-tei-p5-database/debian/changelog ./mydch: 4: [: f: unexpected operator head: cannot open ‘1’ for reading: No such file or directory head: cannot open ‘1’ for reading: No such file or directory head: cannot open ‘1’ for reading: No such file or directory grep: write error: Broken pipe head: cannot open ‘1’ for reading: No such file or directory grep: write error: Broken pipe update with 3.1.1a sh ./mydch debian-tei-p5-doc/debian/changelog ./mydch: 4: [: f: unexpected operator head: cannot open ‘1’ for reading: No such file or directory head: cannot open ‘1’ for reading: No such file or directory head: cannot open ‘1’ for reading: No such file or directory grep: write error: Broken pipe head: cannot open ‘1’ for reading: No such file or directory grep: write error: Broken pipe update with 3.1.1a sh ./mydch debian-tei-p5-exemplars/debian/changelog ./mydch: 4: [: f: unexpected operator head: cannot open ‘1’ for reading: No such file or directory head: cannot open ‘1’ for reading: No such file or directory head: cannot open ‘1’ for reading: No such file or directory grep: write error: Broken pipe head: cannot open ‘1’ for reading: No such file or directory grep: write error: Broken pipe update with 3.1.1a sh ./mydch debian-tei-p5-schema/debian/changelog ./mydch: 4: [: f: unexpected operator head: cannot open ‘1’ for reading: No such file or directory head: cannot open ‘1’ for reading: No such file or directory head: cannot open ‘1’ for reading: No such file or directory grep: write error: Broken pipe head: cannot open ‘1’ for reading: No such file or directory grep: write error: Broken pipe update with 3.1.1a sh ./mydch debian-tei-p5-source/debian/changelog ./mydch: 4: [: f: unexpected operator head: cannot open ‘1’ for reading: No such file or directory head: cannot open ‘1’ for reading: No such file or directory head: cannot open ‘1’ for reading: No such file or directory grep: write error: Broken pipe head: cannot open ‘1’ for reading: No such file or directory grep: write error: Broken pipe update with 3.1.1a sh ./mydch debian-tei-p5-test/debian/changelog ./mydch: 4: [: f: unexpected operator head: cannot open ‘1’ for reading: No such file or directory head: cannot open ‘1’ for reading: No such file or directory head: cannot open ‘1’ for reading: No such file or directory grep: write error: Broken pipe head: cannot open ‘1’ for reading: No such file or directory grep: write error: Broken pipe update with 3.1.1a rm -f tei-p5-*_*deb rm -f tei-p5-*_*changes rm -f tei-p5-*_*build BUILD: make Debian tei-p5-database package (cd debian-tei-p5-database; debclean;debuild -eXSL=<http://teijenkins.hcmc.uvic.ca/job/TEIP5-dev/ws/P5/../../../Stylesheets-dev/lastSuccessful/archive/dist/xml/tei/stylesheet> -eVCS=git -eINJENKINS=true --no-lintian -nc -b -i.svn -I.svn -uc -us) Cleaning in directory . parsechangelog/debian: warning: debian/changelog(l1): badly formatted heading line LINE: ==> parsechangelog/debian: warning: debian/changelog(l2): badly formatted heading line LINE: ==> parsechangelog/debian: warning: debian/changelog(l3): badly formatted heading line LINE: ==> parsechangelog/debian: warning: debian/changelog(l4): badly formatted heading line LINE: ==> parsechangelog/debian: warning: debian/changelog(l5): badly formatted heading line LINE: ==> parsechangelog/debian: warning: debian/changelog(l7): found eof where expected first heading parsechangelog/debian: error: fatal error occurred while parsing debian/changelog dpkg-parsechangelog: error: changelog parser /usr/lib/dpkg/parsechangelog/debian gave error exit status 255 Directory .: unable to determine package name, skipping parsechangelog/debian: warning: debian/changelog(l1): badly formatted heading line LINE: ==> parsechangelog/debian: warning: debian/changelog(l2): badly formatted heading line LINE: ==> parsechangelog/debian: warning: debian/changelog(l3): badly formatted heading line LINE: ==> parsechangelog/debian: warning: debian/changelog(l4): badly formatted heading line LINE: ==> parsechangelog/debian: warning: debian/changelog(l5): badly formatted heading line LINE: ==> parsechangelog/debian: warning: debian/changelog(l7): found eof where expected first heading parsechangelog/debian: error: fatal error occurred while parsing debian/changelog dpkg-parsechangelog: error: changelog parser /usr/lib/dpkg/parsechangelog/debian gave error exit status 255 debuild: fatal error at line 639: cannot execute dpkg-parsechangelog | grep: make: *** [deb] Error 255 Build step 'Execute shell' marked build as failure Archiving artifacts Not sending mail to unregistered user mholmes@uvic.ca Not sending mail to unregistered user lou.burnard@retired.ox.ac.uk

5:43 p.m.
New subject: [tei-council] Build failed in Jenkins: TEIP5-dev #2824
See <http://teijenkins.hcmc.uvic.ca/job/TEIP5-dev/2824/display/redirect?page=changes> Changes: [stadlerpeter] reintroduced missing dashes ------------------------------------------ Started by upstream project "TEIP5-Documentation-dev" build number 2506 originally caused by: Started by upstream project "TEIP5-Test-dev" build number 3296 originally caused by: Started by an SCM change Building in workspace <http://teijenkins.hcmc.uvic.ca/job/TEIP5-dev/ws/> > git rev-parse --is-inside-work-tree # timeout=10 Fetching changes from the remote Git repository > git config remote.origin.url https://github.com/TEIC/TEI.git # timeout=10 Fetching upstream changes from https://github.com/TEIC/TEI.git > git --version # timeout=10 > git fetch --tags --progress https://github.com/TEIC/TEI.git +refs/heads/*:refs/remotes/origin/* > git rev-parse refs/remotes/origin/dev^{commit} # timeout=10 > git rev-parse refs/remotes/origin/origin/dev^{commit} # timeout=10 Checking out Revision c0866244e9e119812b5896405f6af3181800f070 (refs/remotes/origin/dev) > git config core.sparsecheckout # timeout=10 > git checkout -f c0866244e9e119812b5896405f6af3181800f070 > git rev-list 627734578418f23183201f50e5a3ff2e7a07d79a # timeout=10 [workspace] $ /bin/bash -xe /tmp/jenkins142733863870479382.sh + svn update Skipped '.' Summary of conflicts: Skipped paths: 1 [workspace] $ /bin/bash -xe /tmp/jenkins4860108054941236124.sh + cd P5 + rm -f dist-source.stamp dist-schema.stamp dist-test.stamp dist-database.stamp dist-exemplars.stamp [workspace] $ /bin/bash -xe /tmp/jenkins115710596955344830.sh + cd P5 ++ pwd + make VCS=git INJENKINS=true XSL=<http://teijenkins.hcmc.uvic.ca/job/TEIP5-dev/ws/P5/../../../Stylesheets-dev/lastSuccessful/archive/dist/xml/tei/stylesheet> clean deb dist (cd Exemplars; make clean) make[1]: Entering directory `<http://teijenkins.hcmc.uvic.ca/job/TEIP5-dev/ws/P5/Exemplars'> mv tei_lite_fr.nvdl tei_lite_fr.nvdl.bak rm -f *.processed *.xsd *.dtd *.doc.* *.rnc tei*.xsl tei*.rng *.compiled* *~ *.xi *.isosch *.epub *.pdf *.html *.nvdl *-teix* mv tei_lite_fr.nvdl.bak tei_lite_fr.nvdl rm -f exnames.xml rm -f enrich.rng isofs.rng rm -f names.xml *properties rm -f [A-Z]*xml make[1]: Leaving directory `<http://teijenkins.hcmc.uvic.ca/job/TEIP5-dev/ws/P5/Exemplars'> (cd Test; make clean) make[1]: Entering directory `<http://teijenkins.hcmc.uvic.ca/job/TEIP5-dev/ws/P5/Test'> rm -f test*.doc.xml test*.rnc test*.dtd test*.compiled.* test*.xsd test*.rnc test*.rng test*.xsl test*.isosch rm -rf LOG *~ *.xsd Schema RomaResults DTD rm -rf *.doc.* rm -f detest.log detest.log.all rm -f *-examples.rng *-examples.rnc *test*.nvdl *-ex.odd rm -f detest.rnc detest.rng detest.dtd detest.isosch make[1]: Leaving directory `<http://teijenkins.hcmc.uvic.ca/job/TEIP5-dev/ws/P5/Test'> rm -rf release Guidelines Guidelines-web Schema DTD dtd Split rm -rf Guidelines.??? Guidelines-* rm -f *.isosch.xsl rm -f *.stamp rm -f *.xsd rm -f Exemplars/stdout rm -f Test/*.isosch rm -f Test/detest.dtd Test/detest.rnc Test/detest.rng Test/detest.xsl rm -f Test/stdout rm -f Utilities/guidelines.xsl rm -f anything buildweb.xml rm -f p5.sch p5.isosch p5.xml p5subset.xml p5subset.json p5subset.js rm -f p5attlist.txt rm -f p5odds-examples.rng p5odds-examples.rnc p5odds.rng p5odds.rnc p5odds.isosch rm -f pdfbuild.log rm -f stripspace.xsl.model rm -f tei-*.zip rm -f tei-p5-*_*build rm -f tei-p5-*_*changes rm -f tei-p5-*_*deb rm -f teiwebsiteguidelines.zip rm -rf FASC-* rm -rf catalogue.* modList rm -rf valid v.xml ValidatorLog.xml Utilities/pointerattributes.xsl graphics.sh missfont.log v.body v.header Schematron1.xml Schematron2.xml sh ./mydch debian-tei-p5-database/debian/changelog ./mydch: 18: [: =: unexpected operator update with 3.1.1a sh ./mydch debian-tei-p5-doc/debian/changelog ./mydch: 18: [: =: unexpected operator update with 3.1.1a sh ./mydch debian-tei-p5-exemplars/debian/changelog ./mydch: 18: [: =: unexpected operator update with 3.1.1a sh ./mydch debian-tei-p5-schema/debian/changelog ./mydch: 18: [: =: unexpected operator update with 3.1.1a sh ./mydch debian-tei-p5-source/debian/changelog ./mydch: 18: [: =: unexpected operator update with 3.1.1a sh ./mydch debian-tei-p5-test/debian/changelog ./mydch: 18: [: =: unexpected operator update with 3.1.1a rm -f tei-p5-*_*deb rm -f tei-p5-*_*changes rm -f tei-p5-*_*build BUILD: make Debian tei-p5-database package (cd debian-tei-p5-database; debclean;debuild -eXSL=<http://teijenkins.hcmc.uvic.ca/job/TEIP5-dev/ws/P5/../../../Stylesheets-dev/lastSuccessful/archive/dist/xml/tei/stylesheet> -eVCS=git -eINJENKINS=true --no-lintian -nc -b -i.svn -I.svn -uc -us) Cleaning in directory . parsechangelog/debian: warning: debian/changelog(l1): badly formatted heading line LINE: ==> (3.1.1a) natty; urgency=low parsechangelog/debian: warning: debian/changelog(l2): found blank line where expected first heading parsechangelog/debian: warning: debian/changelog(l3): found change data where expected first heading LINE: * new release from upstream parsechangelog/debian: warning: debian/changelog(l7): badly formatted heading line LINE: ==> parsechangelog/debian: warning: debian/changelog(l8): badly formatted heading line LINE: ==> parsechangelog/debian: warning: debian/changelog(l9): badly formatted heading line LINE: ==> parsechangelog/debian: warning: debian/changelog(l10): badly formatted heading line LINE: ==> parsechangelog/debian: warning: debian/changelog(l11): badly formatted heading line LINE: ==> parsechangelog/debian: error: Can't call method "as_string" on an undefined value at /usr/share/perl5/Dpkg/Changelog.pm line 251. dpkg-parsechangelog: error: changelog parser /usr/lib/dpkg/parsechangelog/debian gave error exit status 255 Directory .: unable to determine package name, skipping parsechangelog/debian: warning: debian/changelog(l1): badly formatted heading line LINE: ==> (3.1.1a) natty; urgency=low parsechangelog/debian: warning: debian/changelog(l2): found blank line where expected first heading parsechangelog/debian: warning: debian/changelog(l3): found change data where expected first heading LINE: * new release from upstream parsechangelog/debian: warning: debian/changelog(l7): badly formatted heading line LINE: ==> parsechangelog/debian: warning: debian/changelog(l8): badly formatted heading line LINE: ==> parsechangelog/debian: warning: debian/changelog(l9): badly formatted heading line LINE: ==> parsechangelog/debian: warning: debian/changelog(l10): badly formatted heading line LINE: ==> parsechangelog/debian: warning: debian/changelog(l11): badly formatted heading line LINE: ==> parsechangelog/debian: error: Can't call method "as_string" on an undefined value at /usr/share/perl5/Dpkg/Changelog.pm line 251. dpkg-parsechangelog: error: changelog parser /usr/lib/dpkg/parsechangelog/debian gave error exit status 255 debuild: fatal error at line 639: cannot execute dpkg-parsechangelog | grep: make: *** [deb] Error 255 Build step 'Execute shell' marked build as failure Archiving artifacts Not sending mail to unregistered user lou.burnard@retired.ox.ac.uk Not sending mail to unregistered user mholmes@uvic.ca Not sending mail to unregistered user stadlerpeter@yahoo.fr

6:51 p.m.
New subject: [tei-council] Jenkins build is back to normal : TEIP5-dev #2825
2915
Age (days ago)
2918
Last active (days ago)
12 comments
1 participants
participants (1)
-
Victoria TEI Jenkins