
10 Apr
2017
10 Apr
'17
1:42 a.m.
See <http://teijenkins.hcmc.uvic.ca/job/TEIP5-dev/2823/display/redirect> ------------------------------------------ Started by upstream project "TEIP5-Documentation-dev" build number 2505 originally caused by: Started by upstream project "TEIP5-Test-dev" build number 3295 originally caused by: Started by upstream project "Stylesheets-dev" build number 2187 originally caused by: Started by an SCM change Started by an SCM change Started by an SCM change Started by an SCM change Started by an SCM change Started by an SCM change Started by an SCM change Building in workspace <http://teijenkins.hcmc.uvic.ca/job/TEIP5-dev/ws/> > git rev-parse --is-inside-work-tree # timeout=10 Fetching changes from the remote Git repository > git config remote.origin.url https://github.com/TEIC/TEI.git # timeout=10 Fetching upstream changes from https://github.com/TEIC/TEI.git > git --version # timeout=10 > git fetch --tags --progress https://github.com/TEIC/TEI.git +refs/heads/*:refs/remotes/origin/* > git rev-parse refs/remotes/origin/dev^{commit} # timeout=10 > git rev-parse refs/remotes/origin/origin/dev^{commit} # timeout=10 Checking out Revision 627734578418f23183201f50e5a3ff2e7a07d79a (refs/remotes/origin/dev) > git config core.sparsecheckout # timeout=10 > git checkout -f 627734578418f23183201f50e5a3ff2e7a07d79a > git rev-list 627734578418f23183201f50e5a3ff2e7a07d79a # timeout=10 [workspace] $ /bin/bash -xe /tmp/jenkins8589661614542609957.sh + svn update Skipped '.' Summary of conflicts: Skipped paths: 1 [workspace] $ /bin/bash -xe /tmp/jenkins7600102720648738402.sh + cd P5 + rm -f dist-source.stamp dist-schema.stamp dist-test.stamp dist-database.stamp dist-exemplars.stamp [workspace] $ /bin/bash -xe /tmp/jenkins4169377629411167710.sh + cd P5 ++ pwd + make VCS=git INJENKINS=true XSL=<http://teijenkins.hcmc.uvic.ca/job/TEIP5-dev/ws/P5/../../../Stylesheets-dev/lastSuccessful/archive/dist/xml/tei/stylesheet> clean deb dist (cd Exemplars; make clean) make[1]: Entering directory `<http://teijenkins.hcmc.uvic.ca/job/TEIP5-dev/ws/P5/Exemplars'> mv tei_lite_fr.nvdl tei_lite_fr.nvdl.bak rm -f *.processed *.xsd *.dtd *.doc.* *.rnc tei*.xsl tei*.rng *.compiled* *~ *.xi *.isosch *.epub *.pdf *.html *.nvdl *-teix* mv tei_lite_fr.nvdl.bak tei_lite_fr.nvdl rm -f exnames.xml rm -f enrich.rng isofs.rng rm -f names.xml *properties rm -f [A-Z]*xml make[1]: Leaving directory `<http://teijenkins.hcmc.uvic.ca/job/TEIP5-dev/ws/P5/Exemplars'> (cd Test; make clean) make[1]: Entering directory `<http://teijenkins.hcmc.uvic.ca/job/TEIP5-dev/ws/P5/Test'> rm -f test*.doc.xml test*.rnc test*.dtd test*.compiled.* test*.xsd test*.rnc test*.rng test*.xsl test*.isosch rm -rf LOG *~ *.xsd Schema RomaResults DTD rm -rf *.doc.* rm -f detest.log detest.log.all rm -f *-examples.rng *-examples.rnc *test*.nvdl *-ex.odd rm -f detest.rnc detest.rng detest.dtd detest.isosch make[1]: Leaving directory `<http://teijenkins.hcmc.uvic.ca/job/TEIP5-dev/ws/P5/Test'> rm -rf release Guidelines Guidelines-web Schema DTD dtd Split rm -rf Guidelines.??? Guidelines-* rm -f *.isosch.xsl rm -f *.stamp rm -f *.xsd rm -f Exemplars/stdout rm -f Test/*.isosch rm -f Test/detest.dtd Test/detest.rnc Test/detest.rng Test/detest.xsl rm -f Test/stdout rm -f Utilities/guidelines.xsl rm -f anything buildweb.xml rm -f p5.sch p5.isosch p5.xml p5subset.xml p5subset.json p5subset.js rm -f p5attlist.txt rm -f p5odds-examples.rng p5odds-examples.rnc p5odds.rng p5odds.rnc p5odds.isosch rm -f pdfbuild.log rm -f stripspace.xsl.model rm -f tei-*.zip rm -f tei-p5-*_*build rm -f tei-p5-*_*changes rm -f tei-p5-*_*deb rm -f teiwebsiteguidelines.zip rm -rf FASC-* rm -rf catalogue.* modList rm -rf valid v.xml ValidatorLog.xml Utilities/pointerattributes.xsl graphics.sh missfont.log v.body v.header Schematron1.xml Schematron2.xml sh ./mydch debian-tei-p5-database/debian/changelog ./mydch: 4: [: f: unexpected operator head: cannot open ‘1’ for reading: No such file or directory head: cannot open ‘1’ for reading: No such file or directory head: cannot open ‘1’ for reading: No such file or directory grep: write error: Broken pipe head: cannot open ‘1’ for reading: No such file or directory grep: write error: Broken pipe update with 3.1.1a sh ./mydch debian-tei-p5-doc/debian/changelog ./mydch: 4: [: f: unexpected operator head: cannot open ‘1’ for reading: No such file or directory head: cannot open ‘1’ for reading: No such file or directory head: cannot open ‘1’ for reading: No such file or directory grep: write error: Broken pipe head: cannot open ‘1’ for reading: No such file or directory grep: write error: Broken pipe update with 3.1.1a sh ./mydch debian-tei-p5-exemplars/debian/changelog ./mydch: 4: [: f: unexpected operator head: cannot open ‘1’ for reading: No such file or directory head: cannot open ‘1’ for reading: No such file or directory head: cannot open ‘1’ for reading: No such file or directory grep: write error: Broken pipe head: cannot open ‘1’ for reading: No such file or directory grep: write error: Broken pipe update with 3.1.1a sh ./mydch debian-tei-p5-schema/debian/changelog ./mydch: 4: [: f: unexpected operator head: cannot open ‘1’ for reading: No such file or directory head: cannot open ‘1’ for reading: No such file or directory head: cannot open ‘1’ for reading: No such file or directory grep: write error: Broken pipe head: cannot open ‘1’ for reading: No such file or directory grep: write error: Broken pipe update with 3.1.1a sh ./mydch debian-tei-p5-source/debian/changelog ./mydch: 4: [: f: unexpected operator head: cannot open ‘1’ for reading: No such file or directory head: cannot open ‘1’ for reading: No such file or directory head: cannot open ‘1’ for reading: No such file or directory grep: write error: Broken pipe head: cannot open ‘1’ for reading: No such file or directory grep: write error: Broken pipe update with 3.1.1a sh ./mydch debian-tei-p5-test/debian/changelog ./mydch: 4: [: f: unexpected operator head: cannot open ‘1’ for reading: No such file or directory head: cannot open ‘1’ for reading: No such file or directory head: cannot open ‘1’ for reading: No such file or directory grep: write error: Broken pipe head: cannot open ‘1’ for reading: No such file or directory grep: write error: Broken pipe update with 3.1.1a rm -f tei-p5-*_*deb rm -f tei-p5-*_*changes rm -f tei-p5-*_*build BUILD: make Debian tei-p5-database package (cd debian-tei-p5-database; debclean;debuild -eXSL=<http://teijenkins.hcmc.uvic.ca/job/TEIP5-dev/ws/P5/../../../Stylesheets-dev/lastSuccessful/archive/dist/xml/tei/stylesheet> -eVCS=git -eINJENKINS=true --no-lintian -nc -b -i.svn -I.svn -uc -us) Cleaning in directory . parsechangelog/debian: warning: debian/changelog(l1): badly formatted heading line LINE: ==> parsechangelog/debian: warning: debian/changelog(l2): badly formatted heading line LINE: ==> parsechangelog/debian: warning: debian/changelog(l3): badly formatted heading line LINE: ==> parsechangelog/debian: warning: debian/changelog(l4): badly formatted heading line LINE: ==> parsechangelog/debian: warning: debian/changelog(l5): badly formatted heading line LINE: ==> parsechangelog/debian: warning: debian/changelog(l7): found eof where expected first heading parsechangelog/debian: error: fatal error occurred while parsing debian/changelog dpkg-parsechangelog: error: changelog parser /usr/lib/dpkg/parsechangelog/debian gave error exit status 255 Directory .: unable to determine package name, skipping parsechangelog/debian: warning: debian/changelog(l1): badly formatted heading line LINE: ==> parsechangelog/debian: warning: debian/changelog(l2): badly formatted heading line LINE: ==> parsechangelog/debian: warning: debian/changelog(l3): badly formatted heading line LINE: ==> parsechangelog/debian: warning: debian/changelog(l4): badly formatted heading line LINE: ==> parsechangelog/debian: warning: debian/changelog(l5): badly formatted heading line LINE: ==> parsechangelog/debian: warning: debian/changelog(l7): found eof where expected first heading parsechangelog/debian: error: fatal error occurred while parsing debian/changelog dpkg-parsechangelog: error: changelog parser /usr/lib/dpkg/parsechangelog/debian gave error exit status 255 debuild: fatal error at line 639: cannot execute dpkg-parsechangelog | grep: make: *** [deb] Error 255 Build step 'Execute shell' marked build as failure Archiving artifacts Not sending mail to unregistered user mholmes@uvic.ca Not sending mail to unregistered user lou.burnard@retired.ox.ac.uk